Property	Label
P569	date of birth
P570	date of death
P571	inception
P575	time of discovery or invention
P576	dissolved, abolished or demolished
P577	publication date
P580	start time
P582	end time
P813	retrieved
P1191	date of first performance
P1249	time of earliest written record
P1619	date of official opening
