{
  "{{ cookiecutter.project_name }}.source": {
    "schema_title": "test/event"
  },
  "{{ cookiecutter.project_name }}.sink": {
    "schema_title": "test/event"
  },
  "{{cookiecutter.project_name}}.error": {
    "schema_title": "error"
  }
}

