<svg xmlns="http://www.w3.org/2000/svg" width="24" height="24" viewBox="0 0 24 24" fill="none">
  <mask id="mask0_2333_1165" style="mask-type:alpha" maskUnits="userSpaceOnUse" x="0" y="0" width="24" height="24">
    <rect width="24" height="24" fill="#D9D9D9"/>
  </mask>
  <g mask="url(#mask0_2333_1165)">
    <path d="M3.5 17.6347V16.135H20.5V17.6347H3.5ZM3.5 12.7502V11.2502H20.5V12.7502H3.5ZM3.5 7.86547V6.36572H20.5V7.86547H3.5Z" fill="white"/>
  </g>
</svg>