@startuml
skinparam linetype ortho
hide empty members

entity "locutors.Locutor" << (M,#ff7700) Model >> {
  * <u>id</u>
  * name
  * gender
  * place_of_residence
  * is_main_locutor
  * license
}

entity "locutors.UsesLanguage" << (M,#ff7700) Model >> {
  * <u>id</u>
  * language_qid
  * proficiency
  * place_of_learning
}

entity "user_profile.User" << (M,#ff7700) Model >> {}

Locutor "*" -- "1" UsesLanguage: locutor_id

User "*" - "1" Locutor: linked_user_id
@enduml