@startuml
node "Front-end" {
  [Vue App] as App
  [Record Wizard] as RW

  RW <-> App
}

node "Back-end" {
  cloud "Web-facing" {
    [REST API] as API
  }

  database "Database"

  () "Django REST Framework" as DRF
}

node "Wikimedia Services" {
  () "OAuth provider" as OAuth
  () "Wikimedia Commons API" as WCAPI
  () "Wikidata API" as WDAPI
}

App <--> API: exchanges data

DRF <-right-> Database
DRF <-up-> API

DRF <--> OAuth: delegates user authentication
DRF <--> WCAPI: uploads recordings

App <-> WDAPI: gets labels
@enduml