,wiki_db,N,No,Po,Nx,Px,Nxo,Pxo,Px|o,Exo,logExo
0,enwiki,6385659,298908,0.046809264321818624,288580,0.04519189014007795,147609,0.023115703484949634,0.4938275322172709,10.927348484132668,2.391268682102826
1,cebwiki,5953757,637114,0.10701041376058848,303917,0.05104625533087763,42067,0.00706562259763037,0.06602742994189423,1.2934823429046824,0.2573380719165916
2,svwiki,2910832,501736,0.17236858740044084,132916,0.045662545966239206,40762,0.01400355637151165,0.0812419280258941,1.7791808649031673,0.576153070128234
3,dewiki,2619091,197354,0.07535209734980572,293742,0.11215417868260401,165910,0.06334640529863224,0.8406720917741723,7.495682297788224,2.0143271611388243
4,frwiki,2363875,39960,0.016904447147163028,134634,0.05695478821849717,10650,0.0045053143672994555,0.26651651651651653,4.679440041003613,1.5431784534127977
5,nlwiki,2067850,275892,0.1334197354740431,86134,0.04165389172328747,77766,0.03760717653601567,0.2818711669783828,6.766982755198284,1.9120553088795122
6,ruwiki,1757948,46643,0.026532639190692785,161462,0.09184685781376924,15890,0.009038947682184,0.34067276976180777,3.7091390807572706,1.3107997959864772
7,itwiki,1719115,78371,0.0455879914956242,116452,0.06773950550137717,67072,0.039015423633671976,0.8558267726582537,12.63408651013631,2.53639843985977
8,eswiki,1662659,130652,0.07858015383791866,55607,0.033444620935501504,15212,0.009149200166720897,0.11643143618161222,3.48132025195179,1.2474116045837131
9,plwiki,1491302,105247,0.0705739011950631,80609,0.054052767313394603,33748,0.02262988985463709,0.3206552205763585,5.932262796411872,1.7804057247798846
10,arzwiki,1341002,1098234,0.8189652215283795,117,8.72481920235764e-05,22,1.6405642944604108e-05,2.0032160723488803e-05,0.22959972303008486,-1.4714178208524147
11,jawiki,1292796,42658,0.03299669862839922,74846,0.05789467170381096,18641,0.014419134960194802,0.43698720052510664,7.547969228683641,2.021278550747019
12,viwiki,1268943,653299,0.5148371518657654,10388,0.008186340915234175,1256,0.0009898001722693612,0.0019225500115567298,0.23484851552895952,-1.4488145874617926
13,warwiki,1265580,74435,0.058814930703708974,3870,0.0030578865026312046,1637,0.001293478089097489,0.02199234231208437,7.1920073858728,1.9729703241255214
14,zhwiki,1232696,152473,0.12369067474868094,42067,0.03412601322629424,6334,0.005138330942908876,0.04154178116781332,1.217305428921454,0.19663975122914848
15,arwiki,1138549,238368,0.20936121326354862,30138,0.026470533986679538,4031,0.0035404712489317544,0.016910826956638474,0.6388547720702693,-0.44807812419064313
16,ukwiki,1116468,50491,0.045223866693895394,65592,0.0587495566375391,6060,0.005427831339545782,0.12002138995068427,2.042932692942136,0.7143863700857979
17,ptwiki,1074776,86796,0.08075729268238219,30781,0.028639456035490184,5238,0.0048735736562781455,0.060348403152218996,2.1071770035518447,0.7453491386746665
18,fawiki,835820,186297,0.22289129238352756,22420,0.026823957311382835,12220,0.014620372807542293,0.06559418562832467,2.445358261903047,0.8941916405783042
19,cawiki,688534,32881,0.047755085442403714,16669,0.02420940723333924,3297,0.0047884345580610395,0.1002706730330586,4.141806202300317,1.4211319734433174
20,srwiki,649939,50933,0.07836581586887385,41905,0.06447528152642017,29336,0.0451365435833209,0.5759723558400252,8.93322746646725,2.189777748009889
21,idwiki,597995,54060,0.0904020936629905,6057,0.01012884723116414,1255,0.0020986797548474484,0.02321494635590085,2.291963322783049,0.8294087964482988
22,nowiki,565713,30005,0.05303926195791859,13638,0.024107630547645184,3853,0.006810874065117825,0.12841193134477588,5.326609394108168,1.6727148995674408
23,kowiki,553722,46753,0.08443406619206027,48390,0.08739042335323502,14846,0.026811287974832135,0.317541120355913,3.633591738907147,1.2902216188381563
24,fiwiki,517193,26256,0.05076634834578194,19237,0.037195012306817765,7062,0.013654477148762648,0.2689670932358318,7.231267757546372,1.97841436762444
25,huwiki,492581,18713,0.037989691035586026,21986,0.04463428349855151,3895,0.007907328946914314,0.20814407096670764,4.663322779079951,1.5397282367643925
26,cswiki,489152,27509,0.05623814274499542,25801,0.05274638558157792,8682,0.01774908412926861,0.31560580173761316,5.98345835942626,1.788998721773703
27,shwiki,455880,52721,0.11564666140212336,30365,0.0666074405545319,22919,0.050274194963586906,0.4347224066311337,6.526634307097027,1.875891390367371
28,zh_min_nanwiki,430975,310343,0.7200951331283717,2781,0.006452810487847323,2426,0.00562909681536052,0.007817157145480967,1.2114344842767566,0.19180518162541899
29,trwiki,428977,30500,0.07109938295060109,12170,0.028369819360944758,3384,0.007888534816551936,0.11095081967213115,3.910875083853065,1.3637611555683478
30,rowiki,423411,20939,0.04945313182699552,14028,0.03313092952237896,4648,0.010977513574281254,0.2219781269401595,6.700027138997711,1.90211157698539
31,cewiki,418886,203585,0.4860152881690961,377,0.0009000062069393582,212,0.0005061042861303553,0.0010413340864994965,1.1570298943167854,0.14585628566235245
32,euwiki,377072,90333,0.2395643272372385,5352,0.014193575762719056,1362,0.0036120422624856792,0.015077546411610375,1.062279630141769,0.060417193379250056
33,mswiki,354176,56784,0.16032706902782798,3463,0.009777624683773039,1098,0.003100153595952295,0.01933643279797126,1.9776206822565028,0.6818944464873193
34,ttwiki,319996,134430,0.4200990012375155,3025,0.00945324316553957,434,0.0013562669533369166,0.0032284460313918026,0.34151729463181857,-1.0743569581150518
35,eowiki,304129,11098,0.036491094239615426,10619,0.03491610467926439,1851,0.00608623314448803,0.16678680843395205,4.776787386967644,1.563768225769778
36,hewiki,303687,14427,0.04750614942358415,15056,0.049577360901191025,7251,0.023876557113080243,0.5025992929923061,10.137677436965625,2.3162589223182564
37,hywiki,288215,72793,0.2525649254896518,12181,0.042263587946498274,9410,0.032649237548357996,0.12927067163051392,3.058677171331465,1.117982525546523
38,bgwiki,275312,37602,0.1365795897018655,9022,0.03277009356657174,1844,0.006697855523914686,0.04903994468379341,1.4964847318537502,0.4031188456884064
39,dawiki,269853,25698,0.0952296250180654,10939,0.04053688489659185,2040,0.007559671376638392,0.07938360961942563,1.9583056226922813,0.6720796211474194
40,azbwiki,240896,191103,0.7933008435175345,235,0.0009755247077577046,115,0.000477384431455898,0.0006017697262732663,0.6168677445971266,-0.48310063040823686
41,skwiki,237697,12908,0.05430442958893045,22276,0.09371594929679382,7391,0.031094208172589472,0.5725906414626588,6.109852653247872,1.809902657221337
42,kkwiki,233024,92666,0.3976671930788245,2832,0.01215325460038451,481,0.002064165064542708,0.005190684825070684,0.4271024508041212,-0.8507313629069252
43,minwiki,225051,164370,0.7303677833024514,56,0.0002488324868585343,28,0.00012441624342926714,0.00017034738699276024,0.6845866033947801,-0.3789401215923002
44,etwiki,222348,9146,0.041133718315433464,6743,0.030326335294223468,2449,0.011014265925486174,0.26776732998031927,8.829531408344065,2.1781019450700003
45,bewiki,209176,5882,0.028119860787088384,9623,0.04600432171950893,730,0.003489884116724672,0.12410744644678681,2.697734512932877,0.992412351510496
46,elwiki,197852,22360,0.11301376786689041,5679,0.02870327315367042,1979,0.010002426055839718,0.08850626118067978,3.0834901896671694,1.1260621338867587
47,ltwiki,197736,14713,0.07440729052878585,7732,0.03910264190638022,1796,0.009082817494032447,0.1220689186433766,3.121756298094506,1.1383957594995122
48,simplewiki,196964,20916,0.10619199447614792,3956,0.020084888609085923,1254,0.006366645681444325,0.05995410212277682,2.985035331271642,1.0936115830464241
49,hrwiki,195488,12767,0.06530835652316255,7230,0.036984367326894745,1419,0.007258757570797184,0.11114592308294823,3.005213583905862,1.1003486416363748
50,azwiki,178664,32343,0.18102695562620338,4278,0.023944387229660143,440,0.00246272332422872,0.013604180193550381,0.5681573749650504,-0.5653568300369611
51,glwiki,176642,10166,0.057551431709333,8482,0.04801802515822964,1442,0.00816340394696618,0.14184536690930552,2.954002511388063,1.0831610342740476
52,slwiki,173719,10849,0.062451430183226936,9613,0.05533649169060379,1375,0.007915081251906816,0.12673979168586966,2.290347432838614,0.8287035234550026
53,urwiki,167917,46137,0.27476074489182156,1971,0.011737941959420429,865,0.005151354538254018,0.018748509872770228,1.5972569925448799,0.46828777835573815
54,nnwiki,159735,23483,0.14701223902087834,2862,0.017917175321626445,508,0.0031802673177450153,0.021632670442447727,1.207370584599716,0.18844492448586408
55,kawiki,156853,23351,0.14887187366515145,3777,0.024079870961983513,1131,0.007210572956844944,0.04843475654147574,2.0114209340217353,0.6988414046611349
56,hiwiki,153074,48810,0.31886538536916786,1359,0.008878058978010635,293,0.0019141069025438676,0.006002868264699856,0.6761464729585472,-0.39134555043583924
57,tawiki,145393,45623,0.31379089777362046,1012,0.006960445138349164,174,0.0011967563775422475,0.0038138658132959254,0.5479341820084332,-0.6016001050714305
58,thwiki,141383,12458,0.08811526138220295,3808,0.026933931236428708,1015,0.007179080936180446,0.08147375180606839,3.0249483853984684,1.1068940286590434
59,uzwiki,139780,64098,0.4585634568607812,1708,0.012219201602518243,220,0.001573901845757619,0.003432244375799557,0.28088941384617216,-1.2697942321389761
60,lawiki,136062,1610,0.011832840910761271,3311,0.024334494568652526,207,0.0015213652599550204,0.12857142857142856,5.2835051991198165,1.6645897409279553
61,cywiki,133709,40994,0.3065911793521752,2649,0.01981168058993785,1235,0.00923647622822697,0.03012635995511538,1.5206362639632023,0.41912884198449263
62,astwiki,128111,30580,0.2386992529915464,1449,0.011310504172163203,263,0.0020529072444989112,0.008600392413342053,0.7603898360701614,-0.2739240350140591
63,vowiki,127044,94635,0.7448994049305753,5957,0.046889266710745885,5067,0.03988381977897421,0.05354255825011888,1.1418936999039957,0.1326880245055828
64,zh_yuewiki,119772,17863,0.14914170256821294,7225,0.060322946932505096,3346,0.027936412517115854,0.1873145608240497,3.105195789483471,1.1330767695918385
65,mkwiki,117404,17593,0.14985009028653198,1396,0.011890565909168342,204,0.0017375898606521072,0.011595520945830728,0.9751866340432025,-0.02512640677118103
66,bnwiki,113740,20509,0.18031475294531388,1325,0.0116493757692984,210,0.0018463161596623879,0.010239407089570432,0.8789661602775404,-0.129008880015796
67,lvwiki,109028,8538,0.07831015885827494,6952,0.06376343691528781,2862,0.026250137579337418,0.3352073085031623,5.257045804298444,1.65956923481028
68,mywiki,104501,32183,0.3079683448005282,413,0.003952115290762768,216,0.002066965866355346,0.006711617934934593,1.6982343482290554,0.5295890926352353
69,tgwiki,104406,52951,0.5071643392142214,347,0.0033235637798593952,121,0.0011589372258299332,0.002285131536703745,0.6875545914152483,-0.3746140468989693
70,afwiki,100366,29788,0.29679373493015565,763,0.007602176035709304,172,0.0017137277564115338,0.005774137236471062,0.7595374284084595,-0.27504567783340933
71,mgwiki,94260,48943,0.5192340335242945,1008,0.010693825588796944,853,0.00904943772544027,0.01742843716159614,1.62976635600402,0.488436664669695
72,sqwiki,92887,24817,0.2671740932530925,833,0.008967885710594594,316,0.0034019830546793417,0.012733207075794818,1.4198672336726927,0.35056336982841707
73,bswiki,87547,3763,0.04298262647492204,4646,0.05306863741761568,2176,0.02485522062435035,0.5782620249800691,10.896492789696538,2.388440975045304
74,ocwiki,87091,6667,0.0765521121585468,2129,0.02444569473309527,169,0.001940499018268248,0.02534873256337183,1.0369405672506415,0.036274615406952204
75,ndswiki,82715,40349,0.4878075318865986,43993,0.5318624191500937,32750,0.3959378589131355,0.8116681949986368,1.526086758104977,0.4227067845259803
76,mrwiki,81420,8567,0.105219847703267,202,0.0024809629083763205,33,0.00040530582166543844,0.0038519901949340494,1.5526190181758923,0.4399431941582012
77,kywiki,80945,57565,0.7111619000555933,412,0.0050898758416208535,223,0.002754957069615171,0.003873881698949014,0.7610955197122039,-0.2729964103215661
78,mlwiki,76635,9063,0.11826189078097475,722,0.009421282703725452,71,0.0009264696287597051,0.007834050535142889,0.8315269567322371,-0.1844915614732846
79,be_x_oldwiki,76076,4226,0.05554971344445029,5232,0.06877333193122667,502,0.006598664493401335,0.11878845243729295,1.727245853902809,0.5465281479802441
80,tewiki,73087,5634,0.07708621232230083,4159,0.056904784708634915,1475,0.020181427613665905,0.2618033368832091,4.600726252171941,1.5262141719401143
81,newwiki,73058,31007,0.4244162172520463,199,0.0027238632319526953,65,0.0008897040707383175,0.002096300835295256,0.7696057609296523,-0.26187689404320486
82,brwiki,70150,5347,0.07622238061297221,4688,0.06682822523164647,530,0.007555238774055595,0.09912100243126987,1.4832206315174024,0.3942158258711945
83,vecwiki,68647,1655,0.024108846708523316,124,0.0018063425932670037,54,0.0007866330648098242,0.03262839879154079,18.063239450345968,2.893878903462155
84,swwiki,67320,8671,0.12880273321449792,1670,0.024806892453951276,749,0.011125965537730244,0.08637988697958712,3.4820922104585663,1.2476333230340007
85,pmswiki,65866,37016,0.5619894938207877,1522,0.023107521331187562,1272,0.01931193635563113,0.03436351847849579,1.4871140000687277,0.3968373290106835
86,jvwiki,64918,13011,0.20042207092023784,360,0.005545457346190579,94,0.0014479805292830956,0.007224656060256706,1.3028061725548468,0.26452053232309175
87,pnbwiki,64623,19759,0.3057580118533649,235,0.0036364761772124474,35,0.0005416028349039815,0.001771344703679336,0.4871047182377436,-0.7192761518323533
88,htwiki,64561,43176,0.6687628754201453,2351,0.03641517324700671,127,0.001967131859791515,0.002941448953122105,0.08077536616865852,-2.5160832340889248
89,suwiki,61144,36538,0.5975729425618213,196,0.003205547559858694,32,0.0005233547036503991,0.0008758005364278285,0.273214020404812,-1.2974998334045857
90,lbwiki,60243,3094,0.05135866407715419,1652,0.0274222731271683,632,0.01049084540942516,0.20426632191338073,7.448920115634259,2.008069070963492
91,bawiki,58575,26835,0.45813060179257364,660,0.011267605633802818,38,0.0006487409304310712,0.0014160611142165084,0.1256754238867151,-2.0740526965290185
92,gawiki,55894,8790,0.15726196013883423,323,0.005778795577342828,72,0.0012881525745160483,0.008191126279863481,1.4174452392776762,0.34885612397066496
93,szlwiki,54350,49088,0.903183072677093,129,0.002373505059797608,95,0.001747930082796688,0.0019352998696219035,0.8153763404182206,-0.2041055049387038
94,iswiki,53251,4501,0.08452423428668006,1167,0.021915081406921937,297,0.005577360049576534,0.06598533659186848,3.0109555774238115,1.1022574959612759
95,kuwiki,50555,7275,0.1439026802492335,757,0.01497379092077935,81,0.0016022154089605381,0.0111340206185567,0.7435672554440343,-0.2962960592792039
96,lmowiki,49175,7091,0.14419928825622777,895,0.018200305033045247,363,0.007381799694966955,0.051191651389084755,2.8126809576069753,1.0341381059432586
97,cvwiki,47007,17083,0.36341395962303485,945,0.020103388856978748,255,0.005424723977279979,0.014927120529181057,0.7425176240372634,-0.29770867250985616
98,fywiki,46512,6351,0.13654540763673892,1928,0.04145166838665291,1560,0.033539731682146544,0.24563060935285783,5.925711048869357,1.7793006880687738
99,tlwiki,43556,8879,0.20385251170906418,2210,0.05073927817063091,566,0.012994765359537147,0.063745917333033,1.2563426132839752,0.22820481212500918
100,wuuwiki,42692,20579,0.4820341047503045,147,0.0034432680595896186,57,0.0013351447578000561,0.0027698138879440207,0.8044142483272525,-0.21764090825287954
101,anwiki,40540,2173,0.053601381351751354,1189,0.02932905772076961,219,0.005402072027627035,0.10078232857800276,3.436262069429968,1.2343842728752805
102,scowiki,40512,5028,0.12411137440758294,1918,0.04734399684044234,1134,0.027991706161137442,0.22553699284009546,4.763792833127188,1.5610441646380238
103,diqwiki,40136,2535,0.06316025513254933,307,0.007648993422363962,99,0.0024666135140522225,0.03905325443786982,5.105672378235647,1.6303521526861984
104,pawiki,38344,16755,0.43696536615898185,86,0.00224285416232005,24,0.0006259127894846651,0.001432408236347359,0.6386542024942224,-0.4483921252375057
105,ckbwiki,34925,6082,0.17414459556191839,241,0.00690050107372942,80,0.002290622763063708,0.013153567905294311,1.9061757638688959,0.6450990170710794
106,yowiki,33781,17488,0.5176874574464936,19,0.0005624463455788757,6,0.00017761463544596075,0.00034309240622140897,0.6100002407666009,-0.49429592711551235
107,newiki,32567,8010,0.24595449381275525,149,0.004575183467927657,27,0.0008290600915036694,0.0033707865168539327,0.7367543925797452,-0.3055006952786177
108,barwiki,31761,8857,0.27886401561663676,2800,0.08815843329869966,2170,0.06832278580649224,0.24500395167663994,2.779132324714915,1.0221387655731164
109,iowiki,30873,3830,0.1240566190522463,619,0.020049881773718137,265,0.008583551970977876,0.06919060052219321,3.450923117805607,1.2386417656311357
110,guwiki,29832,2508,0.084070796460177,75,0.00251407884151247,32,0.0010726736390453205,0.012759170653907496,5.075087719298245,1.6243438093692615
111,knwiki,28053,9863,0.35158450076640646,221,0.007877945317791324,110,0.0039211492531993014,0.011152793267768427,1.4156982332158718,0.3476228604242263
112,alswiki,27989,1423,0.05084140197934903,1660,0.059309014255600416,512,0.018292900782450248,0.35980323260716796,6.066585950266279,1.8027960004249661
113,nostalgiawiki,27375,1522,0.05559817351598174,0,0.0,0,0.0,0.0,,
114,scnwiki,26453,3959,0.1496616640834688,1642,0.06207235474237326,954,0.036063962499527466,0.24096994190452134,3.882081530572658,1.3563714867345849
115,bpywiki,25162,10635,0.4226611557109928,486,0.019314839837850727,353,0.014029091487163182,0.03319228960977903,1.7184864015663786,0.5414439043095416
116,iawiki,23321,6137,0.2631533810728528,324,0.013893057759101239,146,0.00626045195317525,0.023790125468469935,1.7123750495376155,0.5378813247186025
117,quwiki,23171,2431,0.10491562729273661,505,0.021794484484916492,131,0.005653618747572396,0.053887289181406825,2.4725195596482723,0.9052376953624169
118,mnwiki,22648,5255,0.2320293182620982,216,0.009537265983751325,50,0.0022077004592016957,0.009514747859181731,0.9976389329386477,-0.002363858775334717
119,siwiki,21435,7169,0.3344529974341031,57,0.0026592022393282016,23,0.0010730114299043621,0.0032082577765378713,1.206473779650689,0.1877018732738048
120,nvwiki,17027,200,0.011746050390556175,154,0.009044458800728255,0,0.0,0.0,0.0,
121,bat_smgwiki,16943,2430,0.14342206220858172,98,0.0057840996281650235,35,0.0020657498672017943,0.01440329218106996,2.4901528512639626,0.912344094642354
122,xmfwiki,16675,2515,0.15082458770614693,48,0.00287856071964018,8,0.00047976011994003,0.0031809145129224653,1.1050364479787937,0.09987831902192974
123,sdwiki,16437,6644,0.4042100139928211,263,0.01600048670681998,186,0.011315933564519072,0.027995183624322698,1.7496457537376129,0.5594133410087767
124,avkwiki,16356,963,0.05887747615553925,9,0.0005502567865003668,1,6.113964294448521e-05,0.0010384215991692627,1.8871581862236069,0.635072092350188
125,orwiki,15886,2845,0.17908850560241724,100,0.006294850812035755,24,0.0015107641948885811,0.00843585237258348,1.3401195079086115,0.29275879499250024
126,gdwiki,15632,1054,0.06742579324462641,256,0.016376663254861822,69,0.0044140225179119755,0.06546489563567362,3.9974501897533203,1.3856567052989532
127,amwiki,15598,4107,0.26330298756250803,79,0.0050647518912681115,39,0.002500320553917169,0.009495982468955442,1.8749156272248984,0.6285636595965096
128,cdowiki,15520,3677,0.2369201030927835,76,0.004896907216494845,22,0.0014175257731958762,0.005983138428066358,1.2218198474156563,0.20034142550792247
129,yiwiki,15382,1996,0.12976205955012352,161,0.010466779352489923,40,0.002600442075152776,0.02004008016032064,1.914636726869889,0.6495279058750631
130,ilowiki,15349,493,0.03211935630985732,300,0.01954524724737768,212,0.013811974721480227,0.4300202839756592,22.001271129141312,3.0911002302865294
131,sahwiki,14939,4175,0.27946984403239844,143,0.009572260526139634,49,0.003280005355110784,0.011736526946107785,1.2260977346007287,0.2038365526080808
132,napwiki,14759,1031,0.06985568127921946,22,0.0014906158953858662,9,0.0006097974117487635,0.008729388942774006,5.85622960938189,1.7675059851427197
133,maiwiki,14559,3666,0.25180300844838244,18,0.00123634865031939,3,0.000206058108386565,0.0008183306055646482,0.6618930714675395,-0.41265125955437953
134,pswiki,14204,5595,0.3939031258800338,222,0.015629400168966488,145,0.010208392002252887,0.025915996425379804,1.6581568163337603,0.5057066338652481
135,bugwiki,14194,149,0.010497393264759758,4,0.0002818092151613358,1,7.045230379033395e-05,0.006711409395973154,23.815436241610737,3.1703339520195786
136,oswiki,14159,2267,0.16011017727240626,443,0.031287520305106294,153,0.01080584787061233,0.0674900749889722,2.1570924870628834,0.7687612441247414
137,frrwiki,14057,180,0.01280500818097745,292,0.020772568826918972,53,0.003770363519954471,0.29444444444444445,14.174676560121764,2.6514570317253954
138,map_bmswiki,13971,5755,0.41192470116670243,32,0.0022904588075298832,6,0.00042946102641185313,0.0010425716768027802,0.45518027801911387,-0.7870617230771675
139,hsbwiki,13793,2090,0.15152613644602334,459,0.03327774958312187,339,0.024577684332632493,0.16220095693779904,4.874156424930419,1.5839470484365683
140,mznwiki,13680,4963,0.3627923976608187,123,0.008991228070175439,38,0.002777777777777778,0.007656659278662099,0.8515699100170531,-0.16067368005693103
141,fowiki,13653,1369,0.1002710027100271,117,0.008569545154911009,32,0.002343807221856002,0.02337472607742878,2.7276507276507274,1.003440699398273
142,liwiki,13490,462,0.03424759080800593,551,0.04084507042253521,153,0.01134173461823573,0.33116883116883117,8.107926556202418,2.092842170359584
143,hawiki,13210,6324,0.47872823618470856,95,0.007191521574564724,33,0.002498107494322483,0.005218216318785579,0.725606711275342,-0.32074713094705226
144,emlwiki,12920,1746,0.13513931888544892,19,0.0014705882352941176,7,0.000541795665634675,0.004009163802978236,2.7262313860252005,1.0029202108259183
145,gorwiki,12842,2156,0.167886622021492,2,0.0001557389814670612,1,7.78694907335306e-05,0.00046382189239332097,2.978200371057514,1.0913192157651606
146,acewiki,12620,10079,0.7986529318541997,2,0.0001584786053882726,1,7.92393026941363e-05,9.921619208254787e-05,0.6260541720408771,-0.468318374819619
147,crhwiki,11942,1902,0.15926980405292246,15,0.001256071009881092,7,0.0005861664712778429,0.003680336487907466,2.9300385559060635,1.0750155819547054
148,bowiki,11780,9241,0.78446519524618,6,0.0005093378607809847,3,0.00025466893039049235,0.0003246401904555784,0.637376907261119,-0.45039410724240797
149,sawiki,11673,1729,0.14811959222136553,51,0.004369056797738371,16,0.0013706844855649791,0.009253903990746095,2.1180553192937097,0.7504983654848284
150,bclwiki,11621,3197,0.27510541261509336,30,0.0025815334308579296,15,0.0012907667154289648,0.0046918986549890525,1.817485142320926,0.597453755603087
151,wawiki,11384,1028,0.09030217849613492,667,0.05859100491918482,49,0.004304286718200984,0.047665369649805445,0.81352708859578,-0.2063760540504191
152,zh_classicalwiki,11069,2735,0.24708645767458667,318,0.028728882464540608,112,0.010118348540970276,0.040950639853747715,1.4254170834626838,0.3544644610444601
153,lijwiki,10774,361,0.033506589938741414,23,0.0021347688880638573,11,0.0010209764247261926,0.030470914127423823,14.27363603516801,2.658414201776819
154,mrjwiki,10533,3161,0.30010443368461026,7,0.0006645779929744612,4,0.00037975885312826357,0.0012654223347042075,1.9040990644913458,0.6440089646855017
155,shnwiki,10387,990,0.09531144700105902,91,0.008760951188986232,26,0.0025031289111389237,0.026262626262626262,2.9976911976911977,1.0978423916038078
156,mhrwiki,10331,898,0.08692285354757526,245,0.023715032426676993,22,0.002129513115864873,0.024498886414253896,1.033053043043498,0.03251853736083475
157,zuwiki,10327,2717,0.2630967367095962,21,0.002033504405926213,16,0.0015493366902294954,0.005888847994111152,2.895911106437422,1.0632997787614145
158,kmwiki,10221,2559,0.25036689169357207,66,0.006457293806868212,12,0.001174053419430584,0.004689331770222743,0.7262069700522221,-0.3199202220691378
159,hifwiki,10202,6049,0.5929229562830818,34,0.0033326798666928055,14,0.001372279945108802,0.0023144321375433955,0.6944657843299329,-0.36461238462494533
160,aswiki,9715,2086,0.21471950591868244,48,0.004940813175501801,6,0.0006176016469377251,0.0028763183125599234,0.5821548418024928,-0.5410188154290133
161,testwiki,9592,6294,0.6561718098415346,0,0.0,0,0.0,0.0,,
162,banwiki,9586,1127,0.11756728562486961,23,0.002399332359691216,5,0.000521593991237221,0.0044365572315882874,1.8490798966089275,0.6146881621847512
163,hakwiki,9523,1765,0.18534075396408695,168,0.017641499527459834,104,0.010920928278903707,0.058923512747875356,3.3400512612977202,1.2059861545647625
164,roa_tarawiki,9317,202,0.021680798540302672,75,0.00804980143823119,2,0.00021466137168616508,0.009900990099009901,1.22996699669967,0.2069873370728551
165,hywwiki,9218,3308,0.3588630939466262,47,0.005098719895855934,36,0.0039054024734215664,0.010882708585247884,2.134400164655638,0.7581856538829229
166,pamwiki,8922,1613,0.18078906074871104,22,0.0024658148397220356,5,0.0005604124635731899,0.0030998140111593306,1.2571154821619792,0.2288197966387856
167,nsowiki,8505,282,0.033156966490299825,5,0.0005878894767783657,0,0.0,0.0,0.0,
168,iewiki,8464,1559,0.18419187145557656,11,0.0012996219281663517,1,0.00011814744801512288,0.0006414368184733803,0.49355647559624466,-0.7061179877580664
169,sowiki,8306,2980,0.35877678786419454,45,0.005417770286539851,8,0.000963159162051529,0.0026845637583892616,0.4955108128262491,-0.702166103399235
170,ruewiki,8227,824,0.10015801628783275,101,0.012276650054697946,16,0.0019448158502491796,0.019417475728155338,1.5816591367874653,0.45847438265798046
171,sewiki,7977,1530,0.19180142910868747,19,0.002381847812460825,8,0.0010028832894571893,0.00522875816993464,2.195252837977296,0.7862972280380437
172,ugwiki,7755,3370,0.4345583494519665,19,0.00245003223726628,5,0.0006447453255963894,0.001483679525222552,0.6055755114789942,-0.5015760144681083
173,snwiki,7707,3000,0.3892565200467108,106,0.01375373037498378,12,0.001557026080186843,0.004,0.29083018867924526,-1.2350157261963204
174,bhwiki,7570,1364,0.18018494055482168,72,0.009511228533685601,14,0.0018494055482166448,0.010263929618768328,1.0791381557510589,0.07616271862729025
175,tkwiki,7540,2223,0.29482758620689653,13,0.0017241379310344827,11,0.0014588859416445623,0.004948268106162843,2.8699955015744494,1.054310462374639
176,vlswiki,7520,346,0.04601063829787234,178,0.023670212765957446,68,0.009042553191489361,0.19653179190751446,8.30291615249724,2.1166067967701827
177,nds_nlwiki,7350,786,0.10693877551020409,422,0.057414965986394555,240,0.0326530612244898,0.3053435114503817,5.3181867515647046,1.6711324090836552
178,miwiki,7268,3684,0.5068794716565768,23,0.0031645569620253164,10,0.001375894331315355,0.0027144408251900108,0.8577633007600435,-0.1534270907942396
179,scwiki,7249,2194,0.3026624361980963,12,0.0016554007449303353,4,0.0005518002483101117,0.0018231540565177757,1.1013369796414463,0.09652487779759243
180,nahwiki,7187,1340,0.18644775288715737,67,0.009322387644357869,24,0.0033393627382774455,0.01791044776119403,1.9212296725328581,0.6529654354804652
181,myvwiki,6697,674,0.10064207854263103,194,0.028968194714051067,12,0.001791847095714499,0.017804154302670624,0.61461041940714,-0.4867666762775847
182,vepwiki,6669,1038,0.1556455240665767,238,0.0356875093717199,20,0.00299895036737142,0.019267822736030827,0.5399038228007966,-0.6163642612110114
183,satwiki,6632,3044,0.4589867310012063,29,0.0043727382388419785,14,0.0021109770808202654,0.0045992115637319315,1.0517921065748332,0.05049547746233881
184,glkwiki,6597,729,0.11050477489768076,11,0.0016674245869334546,2,0.00030316810671517357,0.0027434842249657062,1.6453423120089787,0.49794845497578755
185,ganwiki,6525,821,0.12582375478927202,45,0.006896551724137931,7,0.0010727969348659004,0.008526187576126675,1.236297198538368,0.21212078202345958
186,kabwiki,6251,801,0.12813949768037114,47,0.007518796992481203,18,0.0028795392737162055,0.02247191011235955,2.9887640449438204,1.0948599390495592
187,cowiki,6069,766,0.1262151919591366,44,0.007249958807052232,3,0.0004943153732081067,0.0039164490861618795,0.5402029432708283,-0.6158103891548878
188,fiu_vrowiki,5944,901,0.1515814266487214,411,0.06914535666218034,307,0.05164872139973082,0.3407325194228635,4.9277715217749405,1.5948868618802197
189,abwiki,5844,657,0.11242299794661191,25,0.004277891854893908,10,0.0017111567419575632,0.015220700152207,3.5579908675799086,1.2691960225118244
190,kvwiki,5539,621,0.1121141000180538,16,0.0028886080519949448,6,0.0010832280194981044,0.00966183574879227,3.3448067632850242,1.2074089230878988
191,csbwiki,5419,2397,0.44233253367780034,10,0.0018453589223103894,10,0.0018453589223103894,0.004171881518564873,2.2607425949103046,0.8156933411317299
192,pcdwiki,5346,1528,0.2858211747100636,42,0.007856341189674524,17,0.0031799476243920687,0.01112565445026178,1.4161368735976063,0.3479326527452461
193,frpwiki,5178,554,0.10699111626110468,39,0.007531865585168019,9,0.0017381228273464658,0.016245487364620937,2.1569008608719797,0.7686724047707719
194,aywiki,5156,1172,0.2273079906904577,5,0.000969743987587277,4,0.0007757951900698216,0.0034129692832764505,3.519453924914676,1.2583058426079103
195,udmwiki,5130,971,0.18927875243664719,89,0.017348927875243666,14,0.0027290448343079924,0.014418125643666324,0.8310672421573959,-0.18504457024339097
196,gvwiki,5046,621,0.12306777645659929,80,0.015854141894569955,17,0.003369005152596116,0.027375201288244767,1.7266908212560388,0.5462067566498588
197,pagwiki,4966,284,0.057188884414015304,7,0.001409585179218687,4,0.0008054772452678212,0.014084507042253521,9.99195171026157,2.301779939971483
198,lowiki,4857,1798,0.3701873584517192,302,0.06217829936174593,298,0.061354745727815525,0.1657397107897664,2.665555547370515,0.9804124964447142
199,kwwiki,4794,1069,0.22298706716729244,78,0.016270337922403004,62,0.012932832707551106,0.057998129092609915,3.5646542419227174,1.2710670623247844
200,zeawiki,4793,475,0.09910285833507199,45,0.009388691842269977,11,0.0022950135614437724,0.023157894736842106,2.466573099415205,0.9028297781530409
201,lfnwiki,4744,1152,0.24283305227655985,19,0.004005059021922428,4,0.0008431703204047217,0.003472222222222222,0.8669590643274854,-0.142763518624825
202,arywiki,4657,1218,0.2615417650848186,18,0.003865149237706678,5,0.001073652566029633,0.004105090311986864,1.062078087940157,0.06022744925047066
203,nrmwiki,4620,767,0.166017316017316,90,0.01948051948051948,12,0.0025974025974025974,0.01564537157757497,0.8031290743155151,-0.21923983783373632
204,bjnwiki,4524,1039,0.22966401414677276,12,0.002652519893899204,4,0.0008841732979664014,0.0038498556304138597,1.451395572666025,0.372525557468674
205,szywiki,4459,2609,0.5851087687822382,33,0.007400762502803319,22,0.004933841668535546,0.00843234955921809,1.1393892934713172,0.13049241138258383
206,gnwiki,4416,772,0.17481884057971014,15,0.0033967391304347825,6,0.001358695652173913,0.007772020725388601,2.288082901554404,0.827714306058
207,dvwiki,4320,1207,0.2793981481481482,11,0.0025462962962962965,1,0.0002314814814814815,0.0008285004142502071,0.3253747081418995,-1.1227778126577461
208,mtwiki,4291,909,0.21183873223024935,39,0.00908879049172687,11,0.002563505010487066,0.0121012101210121,1.3314434007503315,0.28626361748277
209,lezwiki,4225,534,0.1263905325443787,43,0.010177514792899408,11,0.0026035502958579883,0.020599250936329586,2.0239961675812213,0.7050738579358875
210,gomwiki,4197,2545,0.6063855134619967,6,0.0014295925661186562,5,0.0011913271384322134,0.0019646365422396855,1.37426326129666,0.3179177775550131
211,mwlwiki,4132,2405,0.5820425943852856,10,0.002420135527589545,4,0.000968054211035818,0.0016632016632016633,0.6872349272349273,-0.3750790841744874
212,stqwiki,4118,288,0.06993686255463817,67,0.016270033997085966,19,0.004613890237979602,0.06597222222222222,4.0548300165837485,1.3999087672272634
213,olowiki,4027,1077,0.26744474795132855,5,0.0012416190712689348,4,0.0009932952570151478,0.003714020427112349,2.9912720519962854,1.0956987323808556
214,rmwiki,3774,494,0.13089560148383678,59,0.01563328033916269,23,0.006094329623741388,0.0465587044534413,2.9781788238523297,1.0913119807640033
215,awawiki,3718,1523,0.4096288327057558,1,0.00026896180742334586,1,0.00026896180742334586,0.0006565988181221273,2.4412344057780695,0.8925038153862275
216,ladwiki,3620,839,0.23176795580110499,21,0.005801104972375691,1,0.00027624309392265195,0.0011918951132300357,0.20546001475679662,-1.5825038393708126
217,dtywiki,3611,951,0.26336194959844916,2,0.0005538631957906397,1,0.00027693159789531985,0.0010515247108307045,1.8985278654048372,0.6410787781721222
218,furwiki,3575,511,0.14293706293706293,22,0.006153846153846154,9,0.0025174825174825175,0.01761252446183953,2.8620352250489236,1.051532988902307
219,koiwiki,3491,237,0.06788885706101404,10,0.002864508736751647,6,0.0017187052420509883,0.02531645569620253,8.837974683544305,2.179057742203914
220,extwiki,3459,1095,0.3165654813529922,28,0.008094825093957791,9,0.0026019080659150044,0.00821917808219178,1.015362035225049,0.015245233847583032
221,angwiki,3442,1256,0.3649041255084253,36,0.010459035444509006,23,0.006682161533991865,0.018312101910828025,1.7508404104741684,0.5600959072163804
222,lnwiki,3351,893,0.26648761563712325,98,0.029245001492091912,23,0.006863622799164429,0.025755879059350503,0.8806933747743219,-0.12704575588061084
223,cbk_zamwiki,3337,820,0.24572969733293376,4,0.001198681450404555,0,0.0,0.0,0.0,
224,dsbwiki,3323,688,0.20704182967198315,33,0.009930785434848028,9,0.002708396027685826,0.01308139534883721,1.317256871035941,0.2755514462909899
225,tyvwiki,3289,2029,0.6169048342961386,67,0.020370933414411676,58,0.017634539373669808,0.02858551010349926,1.4032498914986427,0.3387908975186954
226,piwiki,3230,2629,0.8139318885448916,2,0.0006191950464396285,1,0.00030959752321981426,0.0003803727653100038,0.6143020159756561,-0.4872685890731243
227,gagwiki,2957,713,0.24112275955360163,2,0.0006763611768684477,1,0.00033818058843422386,0.001402524544179523,2.073632538569425,0.7293019188782359
228,kshwiki,2917,691,0.23688721288995543,13,0.004456633527596846,5,0.0017140898183064792,0.00723589001447178,1.6236223978626294,0.48465970107261513
229,bxrwiki,2756,588,0.21335268505079827,33,0.011973875181422351,13,0.0047169811320754715,0.022108843537414966,1.8464234178519892,0.6132504802299787
230,pflwiki,2746,291,0.10597232337946104,20,0.007283321194464676,0,0.0,0.0,0.0,
231,avwiki,2628,658,0.2503805175038052,15,0.005707762557077625,7,0.002663622526636225,0.010638297872340425,1.8638297872340424,0.6226333962322871
232,lgwiki,2558,1958,0.7654417513682564,21,0.008209538702111024,19,0.007427677873338546,0.009703779366700716,1.1820127438104966,0.16721870049134974
233,igwiki,2540,1442,0.5677165354330709,20,0.007874015748031496,7,0.0027559055118110236,0.0048543689320388345,0.6165048543689321,-0.48368908233098973
234,rwwiki,2500,1249,0.4996,2,0.0008,2,0.0008,0.0016012810248198558,2.00160128102482,0.6939475007307144
235,hawwiki,2452,604,0.2463295269168026,6,0.0024469820554649264,3,0.0012234910277324632,0.004966887417218543,2.0298013245033113,0.7079379185613418
236,gcrwiki,2380,1887,0.7928571428571428,3,0.0012605042016806723,3,0.0012605042016806723,0.001589825119236884,1.2612612612612613,0.23211222129697015
237,xalwiki,2317,624,0.26931376780319377,3,0.001294777729823047,2,0.0008631851532153647,0.003205128205128205,2.4754273504273505,0.9064130479547842
238,papwiki,2317,635,0.27406128614587827,9,0.003884333189469141,1,0.00043159257660768235,0.0015748031496062992,0.40542432195975503,-0.9028210517965348
239,zawiki,2122,748,0.352497643732328,22,0.010367577756833177,19,0.008953817153628653,0.02540106951871658,2.450048614487117,0.8961078670075757
240,pdcwiki,2109,1029,0.4879089615931721,3,0.001422475106685633,1,0.000474158368895211,0.0009718172983479105,0.6831875607385812,-0.3809858440233846
241,krcwiki,2069,230,0.111164813919768,80,0.03866602223296278,3,0.0014499758337361043,0.013043478260869565,0.3373369565217391,-1.0866729771834243
242,kaawiki,2064,982,0.4757751937984496,13,0.006298449612403101,12,0.005813953488372093,0.012219959266802444,1.9401535328215573,0.6627671105734511
243,test2wiki,2046,1118,0.5464320625610948,0,0.0,0,0.0,0.0,,
244,kbpwiki,1958,1059,0.5408580183861083,4,0.0020429009193054137,4,0.0020429009193054137,0.003777148253068933,1.8489140698772428,0.6145984774890493
245,inhwiki,1881,358,0.19032429558745348,26,0.013822434875066455,2,0.001063264221158958,0.00558659217877095,0.4041684572410829,-0.9059235145612067
246,tcywiki,1825,780,0.4273972602739726,0,0.0,0,0.0,0.0,,
247,arcwiki,1819,460,0.25288620120945576,146,0.08026388125343595,77,0.04233095107201759,0.1673913043478261,2.0855122096486003,0.735014489180329
248,towiki,1778,190,0.10686164229471316,26,0.014623172103487065,15,0.00843644544431946,0.07894736842105263,5.398785425101215,1.6861740069940918
249,jamwiki,1734,764,0.4405997693194925,4,0.002306805074971165,3,0.0017301038062283738,0.003926701570680628,1.7022251308900522,0.5319362957221857
250,akwiki,1713,1382,0.8067717454757735,32,0.018680677174547577,26,0.015178050204319907,0.01881331403762663,1.0071002170767005,0.007075129218260265
251,wowiki,1693,565,0.3337271116361488,10,0.005906674542232723,5,0.0029533372711163615,0.008849557522123894,1.4982300884955753,0.4042844704267491
252,tpiwiki,1665,212,0.12732732732732732,6,0.0036036036036036037,1,0.0006006006006006006,0.0047169811320754715,1.3089622641509433,0.2692346585144767
253,nawiki,1661,536,0.3226971703792896,9,0.005418422636965683,1,0.0006020469596628537,0.0018656716417910447,0.34432006633499174,-1.0661836287937265
254,kiwiki,1632,1049,0.6427696078431373,0,0.0,0,0.0,0.0,,
255,kbdwiki,1631,685,0.41998773758430413,8,0.004904966278356836,6,0.003678724708767627,0.008759124087591242,1.7857664233576642,0.5798476919070077
256,novwiki,1610,292,0.1813664596273292,11,0.0068322981366459624,5,0.003105590062111801,0.017123287671232876,2.5062266500622665,0.9187782953459568
257,mdfwiki,1595,342,0.21442006269592476,6,0.003761755485893417,4,0.0025078369905956114,0.011695906432748537,3.1091617933723197,1.1343531700481755
258,tetwiki,1592,287,0.18027638190954773,17,0.010678391959798994,7,0.0043969849246231155,0.024390243902439025,2.284074605451937,0.8259609556438045
259,atjwiki,1588,940,0.5919395465994962,1,0.0006297229219143577,0,0.0,0.0,0.0,
260,biwiki,1542,1043,0.6763942931258107,0,0.0,0,0.0,0.0,,
261,lldwiki,1498,109,0.07276368491321762,1,0.0006675567423230974,0,0.0,0.0,0.0,
262,xhwiki,1463,652,0.4456596035543404,16,0.010936431989063569,11,0.007518796992481203,0.01687116564417178,1.5426572085889567,0.43350638965206045
263,mnwwiki,1459,795,0.544893762851268,2,0.0013708019191226869,2,0.0013708019191226869,0.0025157232704402514,1.8352201257861636,0.6071644338684538
264,tywiki,1339,880,0.6572068707991038,1,0.0007468259895444362,0,0.0,0.0,0.0,
265,jbowiki,1335,306,0.2292134831460674,1,0.000749063670411985,0,0.0,0.0,0.0,
266,roa_rupwiki,1331,405,0.304282494365139,2,0.0015026296018031556,1,0.0007513148009015778,0.0024691358024691358,1.64320987654321,0.4966515707286272
267,kgwiki,1277,413,0.32341425215348474,20,0.015661707126076743,8,0.006264682850430697,0.01937046004842615,1.2368038740920095,0.21253053119735135
268,lbewiki,1262,457,0.36212361331220283,3,0.002377179080824089,3,0.002377179080824089,0.006564551422319475,2.761487964989059,1.0157696522069537
269,omwiki,1226,346,0.2822185970636215,0,0.0,0,0.0,0.0,,
270,fjwiki,1218,616,0.5057471264367817,1,0.0008210180623973727,0,0.0,0.0,0.0,
271,srnwiki,1197,765,0.6390977443609023,15,0.012531328320802004,9,0.007518796992481203,0.011764705882352941,0.9388235294117647,-0.06312775203455336
272,bmwiki,1178,412,0.34974533106960953,2,0.001697792869269949,1,0.0008488964346349745,0.0024271844660194173,1.4296116504854368,0.35740283430206027
273,nqowiki,1137,360,0.316622691292876,11,0.009674582233948988,3,0.002638522427440633,0.008333333333333333,0.8613636363636363,-0.14923852182988054
274,smwiki,1077,246,0.22841225626740946,2,0.0018570102135561746,1,0.0009285051067780873,0.0040650406504065045,2.189024390243903,0.7834559606640806
275,chrwiki,1034,467,0.45164410058027077,1,0.0009671179883945841,1,0.0009671179883945841,0.0021413276231263384,2.214132762312634,0.7948607973994772
276,twwiki,1030,734,0.7126213592233009,3,0.002912621359223301,1,0.000970873786407767,0.0013623978201634877,0.4677565849227975,-0.7598072360589437
277,ltgwiki,1017,202,0.19862340216322516,15,0.014749262536873156,5,0.004916420845624385,0.024752475247524754,1.6782178217821784,0.5177324099792456
278,stwiki,977,392,0.40122824974411464,1,0.0010235414534288639,0,0.0,0.0,0.0,
279,gotwiki,975,446,0.4574358974358974,1,0.0010256410256410256,0,0.0,0.0,0.0,
280,pihwiki,919,232,0.25244831338411317,4,0.004352557127312296,3,0.003264417845484222,0.01293103448275862,2.970905172413793,1.0888666782375962
281,nywiki,909,445,0.48954895489548955,5,0.005500550055005501,2,0.0022002200220022,0.0044943820224719105,0.8170786516853932,-0.20201991986291654
282,klwiki,869,137,0.15765247410817032,3,0.0034522439585730723,1,0.0011507479861910242,0.0072992700729927005,2.114355231143552,0.7487499107691573
283,kswiki,865,252,0.29132947976878615,0,0.0,0,0.0,0.0,,
284,tnwiki,856,547,0.639018691588785,2,0.002336448598130841,2,0.002336448598130841,0.003656307129798903,1.5648994515539307,0.447821573719761
285,cuwiki,817,186,0.22766217870257038,20,0.02447980416156671,3,0.0036719706242350062,0.016129032258064516,0.6588709677419354,-0.41722756373907977
286,rmywiki,796,461,0.5791457286432161,1,0.001256281407035176,1,0.001256281407035176,0.0021691973969631237,1.7266811279826464,0.5462011428477345
287,chywiki,787,397,0.5044472681067345,6,0.007623888182973317,4,0.005082592121982211,0.010075566750629723,1.3215785054575986,0.2788268596220484
288,tswiki,734,153,0.20844686648501362,0,0.0,0,0.0,0.0,,
289,tumwiki,726,428,0.5895316804407713,1,0.0013774104683195593,0,0.0,0.0,0.0,
290,rnwiki,725,511,0.7048275862068966,10,0.013793103448275862,9,0.012413793103448275,0.01761252446183953,1.2769080234833659,0.24444154899314396
291,ikwiki,720,402,0.5583333333333333,1,0.001388888888888889,1,0.001388888888888889,0.0024875621890547263,1.7910447761194028,0.5827991233910799
292,vewiki,713,167,0.23422159887798036,0,0.0,0,0.0,0.0,,
293,iuwiki,689,346,0.502177068214804,2,0.002902757619738752,1,0.001451378809869376,0.002890173410404624,0.9956647398843932,-0.004344684604010868
294,eewiki,650,114,0.1753846153846154,3,0.004615384615384616,2,0.003076923076923077,0.017543859649122806,3.8011695906432745,1.3353088063870229
295,ffwiki,648,345,0.5324074074074074,0,0.0,0,0.0,0.0,,
296,adywiki,581,202,0.3476764199655766,1,0.0017211703958691911,1,0.0017211703958691911,0.0049504950495049506,2.876237623762376,1.0564830594507064
297,sswiki,576,181,0.3142361111111111,0,0.0,0,0.0,0.0,,
298,chwiki,557,390,0.7001795332136446,0,0.0,0,0.0,0.0,,
299,sgwiki,540,347,0.6425925925925926,3,0.005555555555555556,2,0.003703703703703704,0.005763688760806916,1.037463976945245,0.03677925150329649
300,pntwiki,530,178,0.33584905660377357,0,0.0,0,0.0,0.0,,
301,dinwiki,507,404,0.796844181459566,0,0.0,0,0.0,0.0,,
302,tiwiki,378,144,0.38095238095238093,0,0.0,0,0.0,0.0,,
303,dzwiki,303,100,0.33003300330033003,0,0.0,0,0.0,0.0,,
304,crwiki,174,126,0.7241379310344828,0,0.0,0,0.0,0.0,,
