,wiki_db,N,No,Po,Nx,Px,Nxo,Pxo,Px|o,Exo,logExo
0,enwiki,6385659,298908,0.046809264321818624,168099,0.02632445609764004,3718,0.0005822421773539739,0.012438609873272043,0.4725115621434302,-0.7496930622029029
1,cebwiki,5953757,637114,0.10701041376058848,5929426,0.9959133367384662,632714,0.10627138460639224,0.9930938576141789,0.9971689513331344,-0.0028350636647026194
2,svwiki,2910832,501736,0.17236858740044084,2130389,0.7318831866627823,435543,0.14962835368032232,0.8680720538291054,1.1860800598348389,0.1706538023738287
3,dewiki,2619091,197354,0.07535209734980572,1622,0.0006192988330684196,172,6.567163951157099e-05,0.0008715303464839831,1.407285626820642,0.34166276166661724
4,frwiki,2363875,39960,0.016904447147163028,79123,0.033471736026651155,185,7.826132938501402e-05,0.004629629629629629,0.13831459551256575,-1.9782245107203178
5,nlwiki,2067850,275892,0.1334197354740431,850266,0.411183596489107,150267,0.07266823028749668,0.5446587795224218,1.3246121298928102,0.2811196844273947
6,ruwiki,1757948,46643,0.026532639190692785,150989,0.0858893437121007,710,0.00040387997824736565,0.01522200544561885,0.17722810290229593,-1.7303176591291471
7,itwiki,1719115,78371,0.0455879914956242,114150,0.06640044441471338,17220,0.010016781890682124,0.21972413265110818,3.3090762356768275,1.1966690675610068
8,eswiki,1662659,130652,0.07858015383791866,1905,0.0011457550826717926,109,6.555763990090572e-05,0.0008342773168416863,0.7281462936182054,-0.3172532982014947
9,plwiki,1491302,105247,0.0705739011950631,185256,0.12422433551353113,13318,0.008930451377387008,0.1265404239550771,1.0186444019359935,0.01847272565907609
10,arzwiki,1341002,1098234,0.8189652215283795,13,9.694243558175156e-06,1,7.457110429365504e-07,9.105527601585819e-07,0.09392715942139836,-2.365235696874511
11,jawiki,1292796,42658,0.03299669862839922,294,0.0002274140699692759,10,7.735172447934555e-06,0.00023442261709409723,1.0308184411183012,0.030353089739171942
12,viwiki,1268943,653299,0.5148371518657654,747448,0.5890319738554056,495713,0.3906503286593645,0.7587842626423735,1.288188581132335,0.25323703088731
13,warwiki,1265580,74435,0.058814930703708974,1143014,0.9031542849918615,65593,0.051828410689170185,0.8812117955262981,0.9757046057022681,-0.024595396471186713
14,zhwiki,1232696,152473,0.12369067474868094,160125,0.1298982068571651,46701,0.037885253136215255,0.306290294019269,2.357925497432486,0.8577822059555025
15,arwiki,1138549,238368,0.20936121326354862,477088,0.41903159196486056,146363,0.12855221865725586,0.6140211773392402,1.4653338533738314,0.38208310276890156
16,ukwiki,1116468,50491,0.045223866693895394,240156,0.21510334375906878,14719,0.013183539519269698,0.2915173001128914,1.3552429963125618,0.30398077132541246
17,ptwiki,1074776,86796,0.08075729268238219,132919,0.12367135105361489,18058,0.01680164052788674,0.20805106226093367,1.6822898794947094,0.5201558888506086
18,fawiki,835820,186297,0.22289129238352756,294896,0.3528223780239765,72827,0.08713239692756813,0.39091880169836335,1.107976211394953,0.10253511823446056
19,cawiki,688534,32881,0.047755085442403714,73525,0.10678485013085774,1166,0.0016934530466178868,0.035461208600711655,0.3320808949701789,-1.1023766801970836
20,srwiki,649939,50933,0.07836581586887385,326571,0.5024640773980328,22494,0.034609401805400196,0.44163901596214633,0.8789464477722191,-0.12903130718906028
21,idwiki,597995,54060,0.0904020936629905,159147,0.26613433222685806,21741,0.03635649127501066,0.4021642619311876,1.5111325869387453,0.41285942724955615
22,nowiki,565713,30005,0.05303926195791859,8450,0.014936902634374674,10,1.7676807851330974e-05,0.0003332777870354941,0.02231237594523201,-3.8026137793352923
23,kowiki,553722,46753,0.08443406619206027,21487,0.038804670935957034,4348,0.007852315783010247,0.09299937971894852,2.3966027149781546,0.8740521991114001
24,fiwiki,517193,26256,0.05076634834578194,5967,0.011537279120173707,85,0.00016434870541557988,0.0032373552711761123,0.28059954495816775,-1.2708267329894758
25,huwiki,492581,18713,0.037989691035586026,79391,0.1611734922784273,431,0.000874982997720172,0.02303211671030834,0.14290263482359958,-1.9455917559825706
26,cswiki,489152,27509,0.05623814274499542,3052,0.006239369357582101,93,0.00019012495093549654,0.0033807117670580536,0.5418354922280411,-0.6127928434884335
27,shwiki,455880,52721,0.11564666140212336,254414,0.5580722997279985,43813,0.0961064315170659,0.8310350714136682,1.4891172197916116,0.39818347443918417
28,zh_min_nanwiki,430975,310343,0.7200951331283717,401237,0.9309983177678519,304816,0.7072707233598237,0.9821906729006293,1.0549865173285333,0.053527987062986955
29,trwiki,428977,30500,0.07109938295060109,17889,0.04170153644600993,2113,0.004925672005725248,0.06927868852459017,1.661298226128521,0.5075993606486479
30,rowiki,423411,20939,0.04945313182699552,184634,0.43606330492122314,8870,0.020948912522348262,0.42361144276230955,0.9714448291833154,-0.028970801089295128
31,cewiki,418886,203585,0.4860152881690961,384594,0.9181352444340465,193084,0.4609464150150638,0.9484195790456075,1.0329846117934716,0.032452293408415635
32,euwiki,377072,90333,0.2395643272372385,200165,0.5308402639283745,72139,0.19131359528153774,0.7985896626924822,1.5043878864475788,0.408386095499453
33,mswiki,354176,56784,0.16032706902782798,58881,0.16624785417419588,20773,0.05865163082761113,0.3658248802479572,2.200478809576951,0.7886749774007612
34,ttwiki,319996,134430,0.4200990012375155,275427,0.860720134001675,124031,0.3876017200215003,0.9226437551141858,1.0719439672273199,0.06947379190501862
35,eowiki,304129,11098,0.036491094239615426,35043,0.11522413186509672,1007,0.0033110949629926775,0.09073706974229591,0.7874832144409643,-0.23891322350511762
36,hewiki,303687,14427,0.04750614942358415,1925,0.006338763266125979,7,2.3050048240458104e-05,0.00048520135856380397,0.07654511427437191,-2.5698749828947465
37,hywiki,288215,72793,0.2525649254896518,68519,0.23773571812709263,15860,0.05502836424197214,0.2178780926737461,0.9164718469324382,-0.08722393019662057
38,bgwiki,275312,37602,0.1365795897018655,35616,0.1293659557156971,19534,0.07095222874411576,0.5194936439551088,4.015690535281022,1.3902093214723592
39,dawiki,269853,25698,0.0952296250180654,15928,0.05902472827798839,6175,0.02288282879938337,0.24029107323527124,4.071023793681419,1.4038945141810937
40,azbwiki,240896,191103,0.7933008435175345,189432,0.7863642401700319,166777,0.69231950717322,0.8727073881624046,1.1098004507093344,0.10418022502720112
41,skwiki,237697,12908,0.05430442958893045,84744,0.35652111722066326,3078,0.012949258930487133,0.23845677099473195,0.6688433292638393,-0.4022054327314979
42,kkwiki,233024,92666,0.3976671930788245,120687,0.5179166094479538,40205,0.1725358761329305,0.4338700278419269,0.8377217874985473,-0.1770692294479912
43,minwiki,225051,164370,0.7303677833024514,1116,0.004958875988109362,1,4.443437265330969e-06,6.083835249741437e-06,0.001226857712177025,-6.7032990839736115
44,etwiki,222348,9146,0.041133718315433464,826,0.003714897368089661,8,3.597963552629212e-05,0.0008746993221080254,0.23545719718168912,-1.4462261349887278
45,bewiki,209176,5882,0.028119860787088384,50300,0.2404673576318507,284,0.0013577083413011052,0.04828289697381843,0.20078773871561517,-1.6055069552021646
46,elwiki,197852,22360,0.11301376786689041,674,0.0034065867416048358,2,1.0108565998827407e-05,8.944543828264758e-05,0.026256615512015417,-3.639837302190736
47,ltwiki,197736,14713,0.07440729052878585,3431,0.017351418052352633,13,6.57442246227293e-05,0.0008835723509821247,0.05092219830772411,-2.977456334431324
48,simplewiki,196964,20916,0.10619199447614792,5101,0.02589813366909689,13,6.600190897829044e-05,0.0006215337540638746,0.023999171600752205,-3.729735965865229
49,hrwiki,195488,12767,0.06530835652316255,14519,0.07427054346046816,349,0.0017852758225568833,0.027336100885094385,0.36806113987363664,-0.999506213652118
50,azwiki,178664,32343,0.18102695562620338,2269,0.012699816415170376,11,6.156808310571799e-05,0.00034010450483875954,0.026780269392909707,-3.6200898792883884
51,glwiki,176642,10166,0.057551431709333,2,1.1322335571381664e-05,1,5.661167785690832e-06,9.83671060397403e-05,8.687881172535903,2.161929085903744
52,slwiki,173719,10849,0.062451430183226936,908,0.005226831837622827,4,2.3025690914638006e-05,0.000368697575813439,0.07053939886865068,-2.6515838760612556
53,urwiki,167917,46137,0.27476074489182156,86950,0.517815349249927,36018,0.21449882977899795,0.7806749463554197,1.5076319145159636,0.41054015127404825
54,nnwiki,159735,23483,0.14701223902087834,1761,0.011024509343600337,0,0.0,0.0,0.0,
55,kawiki,156853,23351,0.14887187366515145,5415,0.034522769727069295,2100,0.013388331750109976,0.08993190869770032,2.60500271005732,0.9574337155338947
56,hiwiki,153074,48810,0.31886538536916786,14382,0.09395455792623175,5767,0.03767458876099142,0.11815201802909239,1.2575442920167772,0.2291608446512106
57,tawiki,145393,45623,0.31379089777362046,23705,0.16304086166459184,12031,0.08274813780580909,0.2637047103434671,1.6174148471194985,0.4808291012587571
58,thwiki,141383,12458,0.08811526138220295,65,0.0004597440993613094,0,0.0,0.0,0.0,
59,uzwiki,139780,64098,0.4585634568607812,119130,0.8522678494777508,60172,0.4304764630133066,0.938750039002777,1.1014730164677928,0.09664838988148507
60,lawiki,136062,1610,0.011832840910761271,5402,0.03970248857138657,0,0.0,0.0,0.0,
61,cywiki,133709,40994,0.3065911793521752,42096,0.3148329581404393,17938,0.13415701261695173,0.43757623066790263,1.389867926320187,0.32920872559235914
62,astwiki,128111,30580,0.2386992529915464,93399,0.7290474666500144,21986,0.17161680105533483,0.7189666448659254,0.9861726125592198,-0.013923876253834165
63,vowiki,127044,94635,0.7448994049305753,109124,0.8589465067220805,85435,0.6724835490066434,0.902784382099646,1.0510367933677967,0.04977709924379721
64,zh_yuewiki,119772,17863,0.14914170256821294,4,3.3396787229068564e-05,0,0.0,0.0,0.0,
65,mkwiki,117404,17593,0.14985009028653198,18188,0.15491806071343395,5773,0.049172089536983404,0.32814187460921956,2.118164099770223,0.7505497228229528
66,bnwiki,113740,20509,0.18031475294531388,4529,0.03981888517671883,1069,0.009398628450852823,0.052123457994051395,1.3090134935401647,0.2692737951558894
67,lvwiki,109028,8538,0.07831015885827494,9,8.254760245074659e-05,3,2.75158674835822e-05,0.00035137034434293746,4.2565784336690875,1.4484656529710023
68,mywiki,104501,32183,0.3079683448005282,68159,0.652232992985713,19600,0.18755801379891102,0.6090171829848057,0.9337417602825039,-0.06855536690335771
69,tgwiki,104406,52951,0.5071643392142214,28209,0.27018562151600484,1693,0.016215543168017165,0.03197295612925157,0.11833700087314827,-2.1342187853609023
70,afwiki,100366,29788,0.29679373493015565,34567,0.34440946137138073,23533,0.23447183309088734,0.7900161138713576,2.293828139115708,0.8302220983399982
71,mgwiki,94260,48943,0.5192340335242945,85843,0.9107044345427541,47332,0.5021430086993423,0.9670841591238788,1.0619078182148436,0.06006711887804705
72,sqwiki,92887,24817,0.2671740932530925,9095,0.09791467051363485,843,0.00907554340219837,0.03396865052181972,0.34692095008469137,-1.0586583345420195
73,bswiki,87547,3763,0.04298262647492204,14246,0.1627240225250437,267,0.0030497903983003416,0.07095402604305076,0.4360390367816204,-0.8300235057382243
74,ocwiki,87091,6667,0.0765521121585468,37301,0.42829913538712383,845,0.00970249509134124,0.12674366281685917,0.29592322828833223,-1.217655222189477
75,ndswiki,82715,40349,0.4878075318865986,1096,0.013250317354772412,4,4.8358822462673033e-05,9.913504671739077e-05,0.0074817111215592855,-4.895293753590482
76,mrwiki,81420,8567,0.105219847703267,936,0.011495946941783346,18,0.0002210759027266028,0.002101085560873118,0.1827675068015911,-1.6995403884885014
77,kywiki,80945,57565,0.7111619000555933,50308,0.6215084316511211,42371,0.5234541972944592,0.7360548944671241,1.1843039562821294,0.1691552233477958
78,mlwiki,76635,9063,0.11826189078097475,3,3.914660403210022e-05,0,0.0,0.0,0.0,
79,be_x_oldwiki,76076,4226,0.05554971344445029,346,0.004548083495451916,0,0.0,0.0,0.0,
80,tewiki,73087,5634,0.07708621232230083,28657,0.39209435330496534,920,0.012587737901405174,0.16329428470003549,0.4164668104083293,-0.8759485074451766
81,newwiki,73058,31007,0.4244162172520463,63461,0.868638615894221,29703,0.40656738481754223,0.957944980165769,1.1028118743945219,0.09786316760547488
82,brwiki,70150,5347,0.07622238061297221,1,1.4255167498218103e-05,1,1.4255167498218103e-05,0.0001870207593042828,13.119506265195435,2.5741001505818755
83,vecwiki,68647,1655,0.024108846708523316,37039,0.5395574460646496,290,0.004224510903608315,0.17522658610271905,0.3247598330460691,-1.1246693450720575
84,swwiki,67320,8671,0.12880273321449792,96,0.00142602495543672,90,0.001336898395721925,0.010379425671779494,7.27857225233537,1.9849347237900106
85,pmswiki,65866,37016,0.5619894938207877,47074,0.714693468557374,29493,0.4477727507363435,0.7967635617030473,1.1148325775403176,0.10870423896537977
86,jvwiki,64918,13011,0.20042207092023784,2418,0.037246988508580055,13,0.00020025262639021535,0.0009991545615248636,0.026825109935926836,-3.6184168922099578
87,pnbwiki,64623,19759,0.3057580118533649,0,0.0,0,0.0,0.0,,
88,htwiki,64561,43176,0.6687628754201453,0,0.0,0,0.0,0.0,,
89,suwiki,61144,36538,0.5975729425618213,19774,0.32340049718696845,13858,0.22664529634960096,0.3792763698067765,1.1727760875627362,0.15937366275645337
90,lbwiki,60243,3094,0.05135866407715419,1626,0.02699068771475524,3,4.979831681689159e-05,0.0009696186166774402,0.03592419085147542,-3.3263443705420883
91,bawiki,58575,26835,0.45813060179257364,28008,0.4781562099871959,17881,0.3052667520273154,0.6663312837711943,1.39354309293408,0.3318494917057686
92,gawiki,55894,8790,0.15726196013883423,6732,0.12044226571725052,2793,0.04996958528643504,0.31774744027303753,2.6381722261766427,0.9700863388117462
93,szlwiki,54350,49088,0.903183072677093,42859,0.7885740570377185,42504,0.7820423183072677,0.8658735332464146,1.0980243713559024,0.09351253897570994
94,iswiki,53251,4501,0.08452423428668006,11,0.0002065688907250568,0,0.0,0.0,0.0,
95,kuwiki,50555,7275,0.1439026802492335,788,0.01558698447235684,2,3.9560874295321925e-05,0.000274914089347079,0.017637413435205054,-4.037732869812127
96,lmowiki,49175,7091,0.14419928825622777,24739,0.5030808337569903,3456,0.07027961362480935,0.48737836694401354,0.9687873881107507,-0.031710104880477014
97,cvwiki,47007,17083,0.36341395962303485,22852,0.4861403620737337,13408,0.2852341140681175,0.7848738511970965,1.6145004867504775,0.4790256127029715
98,fywiki,46512,6351,0.13654540763673892,1,2.149982800137599e-05,1,2.149982800137599e-05,0.0001574555188159345,7.323571091166745,1.9910980629956823
99,tlwiki,43556,8879,0.20385251170906418,96,0.0022040591422536507,0,0.0,0.0,0.0,
100,wuuwiki,42692,20579,0.4820341047503045,2500,0.058558980605265626,279,0.0065351822355476435,0.013557510083094417,0.23151888818698674,-1.4630938183436197
101,anwiki,40540,2173,0.053601381351751354,4234,0.10444005920078935,40,0.000986679822397632,0.01840773124712379,0.1762516355121395,-1.7358425578313126
102,scowiki,40512,5028,0.12411137440758294,47,0.0011601500789889415,1,2.4684044233807267e-05,0.0001988862370723946,0.17143147311227339,-1.7635716659163487
103,diqwiki,40136,2535,0.06316025513254933,1,2.491528802072952e-05,0,0.0,0.0,0.0,
104,pawiki,38344,16755,0.43696536615898185,0,0.0,0,0.0,0.0,,
105,ckbwiki,34925,6082,0.17414459556191839,6544,0.18737294201861132,644,0.01843951324266285,0.10588622163761921,0.5651094576243659,-0.5707358362903768
106,yowiki,33781,17488,0.5176874574464936,2,5.9204878481986913e-05,2,5.9204878481986913e-05,0.00011436413540713633,1.931667429094236,0.658383582822873
107,newiki,32567,8010,0.24595449381275525,823,0.02527097982620444,389,0.01194460650351583,0.048564294631710365,1.921741656465263,0.6532318876038888
108,barwiki,31761,8857,0.27886401561663676,1454,0.045779415005824754,1265,0.039828720758162524,0.14282488427232698,3.119849483750603,1.1377847582700624
109,iowiki,30873,3830,0.1240566190522463,0,0.0,0,0.0,0.0,,
110,guwiki,29832,2508,0.084070796460177,1,3.3521051220166265e-05,0,0.0,0.0,0.0,
111,knwiki,28053,9863,0.35158450076640646,0,0.0,0,0.0,0.0,,
112,alswiki,27989,1423,0.05084140197934903,1134,0.04051591696738004,0,0.0,0.0,0.0,
113,nostalgiawiki,27375,1522,0.05559817351598174,0,0.0,0,0.0,0.0,,
114,scnwiki,26453,3959,0.1496616640834688,0,0.0,0,0.0,0.0,,
115,bpywiki,25162,10635,0.4226611557109928,22936,0.9115332644463874,10157,0.40366425562355934,0.9550540667606958,1.0477446123052245,0.0466398656530341
116,iawiki,23321,6137,0.2631533810728528,296,0.012692423137944341,1,4.2879807898460615e-05,0.00016294606485253382,0.012838058035222775,-4.355341235521465
117,quwiki,23171,2431,0.10491562729273661,2884,0.124465927236632,1,4.3157395019636617e-05,0.00041135335252982314,0.0033049474797047615,-5.712334696968214
118,mnwiki,22648,5255,0.2320293182620982,269,0.011877428470505122,69,0.0030466266336983397,0.01313035204567079,1.1054877811537251,0.10028666847610437
119,siwiki,21435,7169,0.3344529974341031,0,0.0,0,0.0,0.0,,
120,nvwiki,17027,200,0.011746050390556175,0,0.0,0,0.0,0.0,,
121,bat_smgwiki,16943,2430,0.14342206220858172,0,0.0,0,0.0,0.0,,
122,xmfwiki,16675,2515,0.15082458770614693,404,0.024227886056971515,1,5.997001499250375e-05,0.00039761431411530816,0.01641143239572466,-4.109777089711165
123,sdwiki,16437,6644,0.4042100139928211,56,0.003406947739855205,30,0.001825150574922431,0.004515352197471403,1.3253365012470972,0.281666390400346
124,avkwiki,16356,963,0.05887747615553925,0,0.0,0,0.0,0.0,,
125,orwiki,15886,2845,0.17908850560241724,3627,0.22831423895253683,613,0.038587435477779174,0.21546572934973637,0.9437244489798488,-0.0579210527140451
126,gdwiki,15632,1054,0.06742579324462641,3,0.00019191402251791197,0,0.0,0.0,0.0,
127,amwiki,15598,4107,0.26330298756250803,1989,0.12751634824977562,1805,0.11571996409796127,0.4394935476016557,3.446566292353255,1.2373784578468936
128,cdowiki,15520,3677,0.2369201030927835,8882,0.5722938144329897,3010,0.19394329896907217,0.8186021212945336,1.4303878543673905,0.35794563432681165
129,yiwiki,15382,1996,0.12976205955012352,0,0.0,0,0.0,0.0,,
130,ilowiki,15349,493,0.03211935630985732,0,0.0,0,0.0,0.0,,
131,sahwiki,14939,4175,0.27946984403239844,0,0.0,0,0.0,0.0,,
132,napwiki,14759,1031,0.06985568127921946,8056,0.5458364387831154,1,6.775526797208483e-05,0.0009699321047526673,0.001776964738585479,-6.332848573233582
133,maiwiki,14559,3666,0.25180300844838244,2,0.00013737207225771001,2,0.00013737207225771001,0.0005455537370430987,3.971358428805237,1.3791082096736755
134,pswiki,14204,5595,0.3939031258800338,1008,0.07096592509152351,521,0.036679808504646576,0.09311885612153709,1.3121629289189611,0.27167686643900596
135,bugwiki,14194,149,0.010497393264759758,0,0.0,0,0.0,0.0,,
136,oswiki,14159,2267,0.16011017727240626,2478,0.17501235962991737,5,0.0003531322833533442,0.0022055580061755625,0.012602298551024934,-4.3738760569775454
137,frrwiki,14057,180,0.01280500818097745,2,0.00014227786867752722,1,7.113893433876361e-05,0.005555555555555556,39.04722222222222,3.66477173988161
138,map_bmswiki,13971,5755,0.41192470116670243,7014,0.5020399398754563,3274,0.2343425667454012,0.5688966116420504,1.1331700258413298,0.1250190377254608
139,hsbwiki,13793,2090,0.15152613644602334,0,0.0,0,0.0,0.0,,
140,mznwiki,13680,4963,0.3627923976608187,7705,0.5632309941520468,3222,0.2355263157894737,0.6492041104170865,1.152642729462134,0.1420573315718042
141,fowiki,13653,1369,0.1002710027100271,0,0.0,0,0.0,0.0,,
142,liwiki,13490,462,0.03424759080800593,3,0.00022238695329873981,0,0.0,0.0,0.0,
143,hawiki,13210,6324,0.47872823618470856,0,0.0,0,0.0,0.0,,
144,emlwiki,12920,1746,0.13513931888544892,0,0.0,0,0.0,0.0,,
145,gorwiki,12842,2156,0.167886622021492,0,0.0,0,0.0,0.0,,
146,acewiki,12620,10079,0.7986529318541997,0,0.0,0,0.0,0.0,,
147,crhwiki,11942,1902,0.15926980405292246,2040,0.1708256573438285,1225,0.1025791324736225,0.6440588853838065,3.77027020061442,1.3271466701421675
148,bowiki,11780,9241,0.78446519524618,0,0.0,0,0.0,0.0,,
149,sawiki,11673,1729,0.14811959222136553,1840,0.1576287158399726,0,0.0,0.0,0.0,
150,bclwiki,11621,3197,0.27510541261509336,0,0.0,0,0.0,0.0,,
151,wawiki,11384,1028,0.09030217849613492,0,0.0,0,0.0,0.0,,
152,zh_classicalwiki,11069,2735,0.24708645767458667,0,0.0,0,0.0,0.0,,
153,lijwiki,10774,361,0.033506589938741414,0,0.0,0,0.0,0.0,,
154,mrjwiki,10533,3161,0.30010443368461026,2014,0.1912085825500807,1745,0.16566979967720497,0.5520404935147105,2.8871114787440146,1.060256513978944
155,shnwiki,10387,990,0.09531144700105902,0,0.0,0,0.0,0.0,,
156,mhrwiki,10331,898,0.08692285354757526,1813,0.17549123995740973,25,0.0024199012680282644,0.02783964365256125,0.15863836656073374,-1.8411280913394044
157,zuwiki,10327,2717,0.2630967367095962,0,0.0,0,0.0,0.0,,
158,kmwiki,10221,2559,0.25036689169357207,6,0.000587026709715292,2,0.00019567556990509734,0.0007815552950371239,1.3313794450957404,0.28621558150117765
159,hifwiki,10202,6049,0.5929229562830818,1981,0.1941776122328955,1972,0.19329543226818272,0.3260042982311126,1.6788974510619943,0.5181372988399875
160,aswiki,9715,2086,0.21471950591868244,0,0.0,0,0.0,0.0,,
161,testwiki,9592,6294,0.6561718098415346,886,0.09236864053377815,553,0.057652210175145956,0.08786145535430569,0.9512043789599325,-0.050026329999748126
162,banwiki,9586,1127,0.11756728562486961,3,0.00031295639474233255,0,0.0,0.0,0.0,
163,hakwiki,9523,1765,0.18534075396408695,0,0.0,0,0.0,0.0,,
164,roa_tarawiki,9317,202,0.021680798540302672,7521,0.8072340882258238,2,0.00021466137168616508,0.009900990099009901,0.012265327051253192,-4.400978936217237
165,hywwiki,9218,3308,0.3588630939466262,0,0.0,0,0.0,0.0,,
166,pamwiki,8922,1613,0.18078906074871104,0,0.0,0,0.0,0.0,,
167,nsowiki,8505,282,0.033156966490299825,0,0.0,0,0.0,0.0,,
168,iewiki,8464,1559,0.18419187145557656,0,0.0,0,0.0,0.0,,
169,sowiki,8306,2980,0.35877678786419454,1,0.00012039489525644112,1,0.00012039489525644112,0.0003355704697986577,2.787248322147651,1.0250548446912489
170,ruewiki,8227,824,0.10015801628783275,244,0.02965844171629999,0,0.0,0.0,0.0,
171,sewiki,7977,1530,0.19180142910868747,1451,0.18189795662529773,73,0.009151310016296854,0.04771241830065359,0.2623032121187552,-1.3382541462111484
172,ugwiki,7755,3370,0.4345583494519665,2,0.0002578981302385558,1,0.0001289490651192779,0.0002967359050445104,1.150593471810089,0.14027787170428643
173,snwiki,7707,3000,0.3892565200467108,0,0.0,0,0.0,0.0,,
174,bhwiki,7570,1364,0.18018494055482168,1431,0.18903566710700132,165,0.021796565389696168,0.12096774193548387,0.63992020017583,-0.4464117976277835
175,tkwiki,7540,2223,0.29482758620689653,1,0.0001326259946949602,0,0.0,0.0,0.0,
176,vlswiki,7520,346,0.04601063829787234,0,0.0,0,0.0,0.0,,
177,nds_nlwiki,7350,786,0.10693877551020409,492,0.06693877551020408,0,0.0,0.0,0.0,
178,miwiki,7268,3684,0.5068794716565768,4967,0.6834067143643369,3246,0.44661529994496424,0.8811074918566775,1.2892871453219916,0.25408946510805036
179,scwiki,7249,2194,0.3026624361980963,0,0.0,0,0.0,0.0,,
180,nahwiki,7187,1340,0.18644775288715737,1,0.00013914011409489355,0,0.0,0.0,0.0,
181,myvwiki,6697,674,0.10064207854263103,674,0.10064207854263103,0,0.0,0.0,0.0,
182,vepwiki,6669,1038,0.1556455240665767,0,0.0,0,0.0,0.0,,
183,satwiki,6632,3044,0.4589867310012063,0,0.0,0,0.0,0.0,,
184,glkwiki,6597,729,0.11050477489768076,0,0.0,0,0.0,0.0,,
185,ganwiki,6525,821,0.12582375478927202,672,0.10298850574712644,1,0.0001532567049808429,0.001218026796589525,0.011826822690099182,-4.4373852177846835
186,kabwiki,6251,801,0.12813949768037114,0,0.0,0,0.0,0.0,,
187,cowiki,6069,766,0.1262151919591366,1,0.00016477179106936892,0,0.0,0.0,0.0,
188,fiu_vrowiki,5944,901,0.1515814266487214,0,0.0,0,0.0,0.0,,
189,abwiki,5844,657,0.11242299794661191,0,0.0,0,0.0,0.0,,
190,kvwiki,5539,621,0.1121141000180538,0,0.0,0,0.0,0.0,,
191,csbwiki,5419,2397,0.44233253367780034,362,0.06680199298763609,0,0.0,0.0,0.0,
192,pcdwiki,5346,1528,0.2858211747100636,0,0.0,0,0.0,0.0,,
193,frpwiki,5178,554,0.10699111626110468,0,0.0,0,0.0,0.0,,
194,aywiki,5156,1172,0.2273079906904577,0,0.0,0,0.0,0.0,,
195,udmwiki,5130,971,0.18927875243664719,152,0.02962962962962963,33,0.006432748538011696,0.03398558187435633,1.1470133882595261,0.13716151049369404
196,gvwiki,5046,621,0.12306777645659929,0,0.0,0,0.0,0.0,,
197,pagwiki,4966,284,0.057188884414015304,0,0.0,0,0.0,0.0,,
198,lowiki,4857,1798,0.3701873584517192,17,0.0035001029442042414,0,0.0,0.0,0.0,
199,kwwiki,4794,1069,0.22298706716729244,0,0.0,0,0.0,0.0,,
200,zeawiki,4793,475,0.09910285833507199,1730,0.3609430419361569,196,0.04089296891299812,0.4126315789473684,1.1432041375114084,0.1338349668636825
201,lfnwiki,4744,1152,0.24283305227655985,0,0.0,0,0.0,0.0,,
202,arywiki,4657,1218,0.2615417650848186,183,0.03929568391668456,26,0.0055829933433540905,0.021346469622331693,0.5432268253070967,-0.610228320107404
203,nrmwiki,4620,767,0.166017316017316,0,0.0,0,0.0,0.0,,
204,bjnwiki,4524,1039,0.22966401414677276,0,0.0,0,0.0,0.0,,
205,szywiki,4459,2609,0.5851087687822382,0,0.0,0,0.0,0.0,,
206,gnwiki,4416,772,0.17481884057971014,1,0.00022644927536231884,1,0.00022644927536231884,0.0012953367875647669,5.72020725388601,1.744005037932155
207,dvwiki,4320,1207,0.2793981481481482,0,0.0,0,0.0,0.0,,
208,mtwiki,4291,909,0.21183873223024935,0,0.0,0,0.0,0.0,,
209,lezwiki,4225,534,0.1263905325443787,0,0.0,0,0.0,0.0,,
210,gomwiki,4197,2545,0.6063855134619967,0,0.0,0,0.0,0.0,,
211,mwlwiki,4132,2405,0.5820425943852856,0,0.0,0,0.0,0.0,,
212,stqwiki,4118,288,0.06993686255463817,1,0.00024283632831471587,1,0.00024283632831471587,0.003472222222222222,14.298611111111112,2.660162407451789
213,olowiki,4027,1077,0.26744474795132855,0,0.0,0,0.0,0.0,,
214,rmwiki,3774,494,0.13089560148383678,0,0.0,0,0.0,0.0,,
215,awawiki,3718,1523,0.4096288327057558,0,0.0,0,0.0,0.0,,
216,ladwiki,3620,839,0.23176795580110499,0,0.0,0,0.0,0.0,,
217,dtywiki,3611,951,0.26336194959844916,0,0.0,0,0.0,0.0,,
218,furwiki,3575,511,0.14293706293706293,121,0.033846153846153845,0,0.0,0.0,0.0,
219,koiwiki,3491,237,0.06788885706101404,0,0.0,0,0.0,0.0,,
220,extwiki,3459,1095,0.3165654813529922,0,0.0,0,0.0,0.0,,
221,angwiki,3442,1256,0.3649041255084253,0,0.0,0,0.0,0.0,,
222,lnwiki,3351,893,0.26648761563712325,0,0.0,0,0.0,0.0,,
223,cbk_zamwiki,3337,820,0.24572969733293376,0,0.0,0,0.0,0.0,,
224,dsbwiki,3323,688,0.20704182967198315,4,0.0012037315678603672,0,0.0,0.0,0.0,
225,tyvwiki,3289,2029,0.6169048342961386,0,0.0,0,0.0,0.0,,
226,piwiki,3230,2629,0.8139318885448916,2532,0.7839009287925697,2530,0.7832817337461301,0.9623430962343096,1.2276335706306558,0.20508838994432027
227,gagwiki,2957,713,0.24112275955360163,570,0.1927629354075076,4,0.0013527223537368955,0.005610098176718092,0.029103614576412983,-3.536892900270524
228,kshwiki,2917,691,0.23688721288995543,6,0.002056907781967775,4,0.0013712718546451835,0.005788712011577424,2.8142788229618914,1.0347060379918873
229,bxrwiki,2756,588,0.21335268505079827,0,0.0,0,0.0,0.0,,
230,pflwiki,2746,291,0.10597232337946104,1,0.0003641660597232338,0,0.0,0.0,0.0,
231,avwiki,2628,658,0.2503805175038052,155,0.05898021308980213,3,0.001141552511415525,0.004559270516717325,0.07730169624472988,-2.5600393799719527
232,lgwiki,2558,1958,0.7654417513682564,0,0.0,0,0.0,0.0,,
233,igwiki,2540,1442,0.5677165354330709,0,0.0,0,0.0,0.0,,
234,rwwiki,2500,1249,0.4996,0,0.0,0,0.0,0.0,,
235,hawwiki,2452,604,0.2463295269168026,0,0.0,0,0.0,0.0,,
236,gcrwiki,2380,1887,0.7928571428571428,0,0.0,0,0.0,0.0,,
237,papwiki,2317,635,0.27406128614587827,0,0.0,0,0.0,0.0,,
238,xalwiki,2317,624,0.26931376780319377,0,0.0,0,0.0,0.0,,
239,zawiki,2122,748,0.352497643732328,0,0.0,0,0.0,0.0,,
240,pdcwiki,2109,1029,0.4879089615931721,2,0.000948316737790422,0,0.0,0.0,0.0,
241,krcwiki,2069,230,0.111164813919768,376,0.18173030449492508,0,0.0,0.0,0.0,
242,kaawiki,2064,982,0.4757751937984496,0,0.0,0,0.0,0.0,,
243,test2wiki,2046,1118,0.5464320625610948,361,0.17644183773216032,130,0.0635386119257087,0.11627906976744186,0.6590220962442827,-0.41699821508077123
244,kbpwiki,1958,1059,0.5408580183861083,0,0.0,0,0.0,0.0,,
245,inhwiki,1881,358,0.19032429558745348,0,0.0,0,0.0,0.0,,
246,tcywiki,1825,780,0.4273972602739726,0,0.0,0,0.0,0.0,,
247,arcwiki,1819,460,0.25288620120945576,0,0.0,0,0.0,0.0,,
248,towiki,1778,190,0.10686164229471316,0,0.0,0,0.0,0.0,,
249,jamwiki,1734,764,0.4405997693194925,0,0.0,0,0.0,0.0,,
250,akwiki,1713,1382,0.8067717454757735,0,0.0,0,0.0,0.0,,
251,wowiki,1693,565,0.3337271116361488,0,0.0,0,0.0,0.0,,
252,tpiwiki,1665,212,0.12732732732732732,0,0.0,0,0.0,0.0,,
253,nawiki,1661,536,0.3226971703792896,0,0.0,0,0.0,0.0,,
254,kiwiki,1632,1049,0.6427696078431373,0,0.0,0,0.0,0.0,,
255,kbdwiki,1631,685,0.41998773758430413,0,0.0,0,0.0,0.0,,
256,novwiki,1610,292,0.1813664596273292,65,0.040372670807453416,0,0.0,0.0,0.0,
257,mdfwiki,1595,342,0.21442006269592476,0,0.0,0,0.0,0.0,,
258,tetwiki,1592,287,0.18027638190954773,429,0.2694723618090452,1,0.000628140703517588,0.003484320557491289,0.012930159271622688,-4.34819276828331
259,atjwiki,1588,940,0.5919395465994962,0,0.0,0,0.0,0.0,,
260,biwiki,1542,1043,0.6763942931258107,0,0.0,0,0.0,0.0,,
261,lldwiki,1498,109,0.07276368491321762,0,0.0,0,0.0,0.0,,
262,xhwiki,1463,652,0.4456596035543404,3,0.002050580997949419,2,0.001367053998632946,0.003067484662576687,1.4959100204498978,0.40273473098530704
263,mnwwiki,1459,795,0.544893762851268,0,0.0,0,0.0,0.0,,
264,tywiki,1339,880,0.6572068707991038,0,0.0,0,0.0,0.0,,
265,jbowiki,1335,306,0.2292134831460674,3,0.0022471910112359553,0,0.0,0.0,0.0,
266,roa_rupwiki,1331,405,0.304282494365139,0,0.0,0,0.0,0.0,,
267,kgwiki,1277,413,0.32341425215348474,0,0.0,0,0.0,0.0,,
268,lbewiki,1262,457,0.36212361331220283,50,0.039619651347068144,0,0.0,0.0,0.0,
269,omwiki,1226,346,0.2822185970636215,0,0.0,0,0.0,0.0,,
270,fjwiki,1218,616,0.5057471264367817,21,0.017241379310344827,21,0.017241379310344827,0.03409090909090909,1.977272727272727,0.6817184847363225
271,srnwiki,1197,765,0.6390977443609023,0,0.0,0,0.0,0.0,,
272,bmwiki,1178,412,0.34974533106960953,0,0.0,0,0.0,0.0,,
273,nqowiki,1137,360,0.316622691292876,0,0.0,0,0.0,0.0,,
274,smwiki,1077,246,0.22841225626740946,0,0.0,0,0.0,0.0,,
275,chrwiki,1034,467,0.45164410058027077,0,0.0,0,0.0,0.0,,
276,twwiki,1030,734,0.7126213592233009,0,0.0,0,0.0,0.0,,
277,ltgwiki,1017,202,0.19862340216322516,0,0.0,0,0.0,0.0,,
278,stwiki,977,392,0.40122824974411464,0,0.0,0,0.0,0.0,,
279,gotwiki,975,446,0.4574358974358974,0,0.0,0,0.0,0.0,,
280,pihwiki,919,232,0.25244831338411317,0,0.0,0,0.0,0.0,,
281,nywiki,909,445,0.48954895489548955,0,0.0,0,0.0,0.0,,
282,klwiki,869,137,0.15765247410817032,0,0.0,0,0.0,0.0,,
283,kswiki,865,252,0.29132947976878615,18,0.020809248554913295,18,0.020809248554913295,0.07142857142857142,3.4325396825396823,1.233300419420456
284,tnwiki,856,547,0.639018691588785,0,0.0,0,0.0,0.0,,
285,cuwiki,817,186,0.22766217870257038,1,0.0012239902080783353,1,0.0012239902080783353,0.005376344086021506,4.39247311827957,1.4798924211468016
286,rmywiki,796,461,0.5791457286432161,0,0.0,0,0.0,0.0,,
287,chywiki,787,397,0.5044472681067345,0,0.0,0,0.0,0.0,,
288,tswiki,734,153,0.20844686648501362,0,0.0,0,0.0,0.0,,
289,tumwiki,726,428,0.5895316804407713,0,0.0,0,0.0,0.0,,
290,rnwiki,725,511,0.7048275862068966,0,0.0,0,0.0,0.0,,
291,ikwiki,720,402,0.5583333333333333,0,0.0,0,0.0,0.0,,
292,vewiki,713,167,0.23422159887798036,0,0.0,0,0.0,0.0,,
293,iuwiki,689,346,0.502177068214804,0,0.0,0,0.0,0.0,,
294,eewiki,650,114,0.1753846153846154,0,0.0,0,0.0,0.0,,
295,ffwiki,648,345,0.5324074074074074,0,0.0,0,0.0,0.0,,
296,adywiki,581,202,0.3476764199655766,0,0.0,0,0.0,0.0,,
297,sswiki,576,181,0.3142361111111111,0,0.0,0,0.0,0.0,,
298,chwiki,557,390,0.7001795332136446,0,0.0,0,0.0,0.0,,
299,sgwiki,540,347,0.6425925925925926,0,0.0,0,0.0,0.0,,
300,pntwiki,530,178,0.33584905660377357,0,0.0,0,0.0,0.0,,
301,dinwiki,507,404,0.796844181459566,0,0.0,0,0.0,0.0,,
302,tiwiki,378,144,0.38095238095238093,0,0.0,0,0.0,0.0,,
303,dzwiki,303,100,0.33003300330033003,0,0.0,0,0.0,0.0,,
304,crwiki,174,126,0.7241379310344828,0,0.0,0,0.0,0.0,,
