<svg width="14" height="14" viewBox="0 0 14 14" fill="none" xmlns="http://www.w3.org/2000/svg">
  <path
    d="M8.41652 9.37354L9.35352 8.47754L12.2705 11.3735V8.99754H13.6035V13.6435H8.95752V12.3105H11.3335L8.41652 9.37354ZM0.687515 6.53954H6.89552L11.3535 2.06054H8.95752V0.727539H13.6035V5.37354H12.2705V3.01854L7.43752 7.87354H0.687515V6.53954Z"
    fill="#1C1B1F" />
</svg>