{
	"name": "CommentStreams All Discussions",
	"author": [
		"[https://www.mediawiki.org/wiki/User:MarkAHershberger MarkAHershberger]"
	],
	"url": "https://www.mediawiki.org/wiki/Extension:CommentStreamsAllDiscussions",
	"descriptionmsg": "commentstreams-all-discussions-desc",
	"manifest_version": 2,
	"type": "parserhook",
	"license-name": "GPLv3-or-greater",
	"requires": {
		"MediaWiki": ">= 1.38.0",
		"extensions": {
			"CommentStreams": ">= 8.0.0"
		}
	},
	"SpecialPages": {
		"CommentStreamsAllDiscussions": {
			"class": "MediaWiki\\Extension\\CommentStreamsAllDiscussions",
			"services": [
				"CommentStreamsStore",
				"CommentStreamsFactory",
				"LinkRenderer",
				"WikiPageFactory"
			]
		}
	},
	"MessagesDirs": {
		"CommentStreams": ["i18n"]
	},
	"ExtensionMessagesFiles": {
		"CommentStreamsAllDiscussions": "includes/CommentStreamsAllDiscussions.alias.php"
	},
	"ResourceModules": {},
	"ResourceFileModulePaths": {},
	"ServiceWiringFiles": [],
	"AutoloadNamespaces": {
		"MediaWiki\\Extension\\CommentStreamsAllDiscussions\\": "includes/"
	},
	"APIModules": {},
	"HookHandlers": {
		"main": {
			"class": "MediaWiki\\Extension\\CommentStreamsAllDiscussions\\MainHooks",
			"services": [
				"CommentStreamsHandler",
				"CommentStreamsFactory",
				"CommentStreamsStore",
				"LinkRenderer",
				"RevisionStore",
				"PermissionManager",
				"PageProps",
				"WikiPageFactory"
			]
		},
		"noservice": {
			"class": "MediaWiki\\Extension\\CommentStreamsAllDiscussions\\NoServiceHooks"
		}
	},
	"Hooks": {
		"GetUserPermissionsErrors": "main",
		"CanonicalNamespaces": "noservice",
		"BeforeCreateEchoEvent": "MediaWiki\\Extension\\CommentStreamsAllDiscussions\\EchoInterface::onBeforeCreateEchoEvent"
	},
	"callback": "MediaWiki\\Extension\\CommentStreamsAllDiscussions\\MainHooks::onRegistration",
	"config": {}
}
