{
	"data": {
		"rules": "action == 'edit' \u0026\r\npage_namespace == 0 \u0026\r\npage_title contains \"Community Wishlist/Wishes/\" \u0026\r\n!contains_any(user_name, \"FuzzyBot\", \"Community Tech bot\") \u0026\r\npage_id \u003E 0 \u0026\r\ncontains_any(added_lines, \"type\", \"projects\") \u0026 (\r\n    types_regex := \"type\\s*=\\s*(feature|bug|change)\";\r\n    projects_regex := \"projects\\s*=\\s*(wikipedia|wikidata|commons|wikisource|wiktionary|wikivoyage|wikiquote|wikiversity|wikifunctions|wikispecies|wikinews|metawiki|wmcs|,)+\";\r\n    !(added_lines irlike (\"\\|\\s*(\" + types_regex + \"|\" + projects_regex + \")$\"))\r\n)",
		"name": "Community Wishlist: enforce values of enum fields",
		"comments": "",
		"group": "default",
		"actions": {
			"warn": [
				"abusefilter-warning-wishlist-enum-field"
			]
		},
		"enabled": true,
		"deleted": false,
		"hidden": false,
		"global": false
	},
	"actions": {
		"warn": [
			"abusefilter-warning-wishlist-enum-field"
		]
	}
}
