{
	"$schema": "https://json-schema.org/draft/2020-12/schema",
	"$id": "https://admin.toolforge.org/schema/k8s/image-config.schema.json",
	"title": "Toolforge K8s image configuration",
	"description": "Describes an available image on the Toolforge Kubernetes cluster.",
	"type": "object",
	"properties": {
		"state": {
			"description": "Stability of this image",
			"type": "string",
			"enum": ["stable", "deprecated"]
		},
		"variants": {
			"description": "Versions of this image for various services",
			"type": "object",
			"additionalProperties": {
				"type": "object",
				"description": "A single version of an image",
				"properties": {
					"image": {
						"type": "string",
						"description": "The container image URL without the tag"
					},
					"extra": {
						"type": "object",
						"description": "Extra data for this provider, for example for launch configuration. Future versions of this schema might include these as documented properties."
					}
				},
				"additionalProperties": false,
				"required": [
					"image"
				]
			}
		},
		"aliases": {
			"description": "Recognized aliases of this image",
			"type": "array",
			"items": {
				"type": "string"
			},
			"uniqueItems": true
		}
	},
	"additionalProperties": false,
	"required": [
		"state",
		"variants"
	]
}
