{ "type": "articles", "identifier": "/eswiki/Guns_N'_Roses" }
{ "name": "Guns_N'_Roses", "is_part_of": { "identifier":"eswiki" }, "in_language": { "identifier": "es" }, "namespace": { "identifier": 0 },"version": { "identifier": 1 }, "event": { "type": "delete" , "date_created":"2023-10-11T13:45:33.749328+01:00"} } 

{ "type": "articles", "identifier": "/enwiki/Marshall_Mathers" }
{ "name": "Marshall_Mathers", "is_part_of": { "identifier":"enwiki" }, "in_language": { "identifier": "en" }, "namespace": { "identifier": 0 },"version": { "identifier": 1 }, "event": { "type": "delete" , "date_created":"2023-10-11T13:45:33.749328+01:00"} }

{ "type": "articles", "identifier": "/eswiki/Test_article_that_does_not_exist" }
{ "name": "Test_article_that_does_not_exist", "is_part_of": { "identifier":"eswiki" }, "in_language": { "identifier": "es" }, "namespace": { "identifier": 0 }, "version": { "identifier": 1 }, "event": { "type": "delete" , "date_created":"2023-10-11T13:45:33.749328+01:00"} }
