{
  "aawiki": "aa",
  "aawikibooks": "aa",
  "aawiktionary": "aa",
  "abwiki": "ab",
  "abwiktionary": "ab",
  "acewiki": "ace",
  "adywiki": "ady",
  "afwiki": "af",
  "afwikibooks": "af",
  "afwikiquote": "af",
  "afwiktionary": "af",
  "akwiki": "ak",
  "akwikibooks": "ak",
  "akwiktionary": "ak",
  "alswiki": "als",
  "altwiki": "alt",
  "amiwiki": "ami",
  "amwiki": "am",
  "amwikiquote": "am",
  "amwiktionary": "am",
  "angwiki": "ang",
  "angwikibooks": "ang",
  "angwikiquote": "ang",
  "angwikisource": "ang",
  "angwiktionary": "ang",
  "anwiki": "an",
  "anwiktionary": "an",
  "arcwiki": "arc",
  "arwiki": "ar",
  "arwikibooks": "ar",
  "arwikinews": "ar",
  "arwikiquote": "ar",
  "arwikisource": "ar",
  "arwikiversity": "ar",
  "arwiktionary": "ar",
  "arywiki": "ary",
  "arzwiki": "arz",
  "astwiki": "ast",
  "astwikibooks": "ast",
  "astwikiquote": "ast",
  "astwiktionary": "ast",
  "aswiki": "as",
  "aswikibooks": "as",
  "aswikiquote": "as",
  "aswikisource": "as",
  "aswiktionary": "as",
  "atjwiki": "atj",
  "avkwiki": "avk",
  "avwiki": "av",
  "avwiktionary": "av",
  "awawiki": "awa",
  "aywiki": "ay",
  "aywikibooks": "ay",
  "aywiktionary": "ay",
  "azbwiki": "azb",
  "azwiki": "az",
  "azwikibooks": "az",
  "azwikiquote": "az",
  "azwikisource": "az",
  "azwiktionary": "az",
  "banwiki": "ban",
  "banwikisource": "ban",
  "barwiki": "bar",
  "bat_smgwiki": "bat-smg",
  "bawiki": "ba",
  "bawikibooks": "ba",
  "bclwiki": "bcl",
  "bclwikiquote": "bcl",
  "bclwiktionary": "bcl",
  "be_x_oldwiki": "be-x-old",
  "bewiki": "be",
  "bewikibooks": "be",
  "bewikiquote": "be",
  "bewikisource": "be",
  "bewiktionary": "be",
  "bgwiki": "bg",
  "bgwikibooks": "bg",
  "bgwikinews": "bg",
  "bgwikiquote": "bg",
  "bgwikisource": "bg",
  "bgwiktionary": "bg",
  "bhwiki": "bh",
  "bhwiktionary": "bh",
  "biwiki": "bi",
  "biwikibooks": "bi",
  "biwiktionary": "bi",
  "bjnwiki": "bjn",
  "bjnwiktionary": "bjn",
  "blkwiki": "blk",
  "bmwiki": "bm",
  "bmwikibooks": "bm",
  "bmwikiquote": "bm",
  "bmwiktionary": "bm",
  "bnwiki": "bn",
  "bnwikibooks": "bn",
  "bnwikiquote": "bn",
  "bnwikisource": "bn",
  "bnwikivoyage": "bn",
  "bnwiktionary": "bn",
  "bowiki": "bo",
  "bowikibooks": "bo",
  "bowiktionary": "bo",
  "bpywiki": "bpy",
  "brwiki": "br",
  "brwikiquote": "br",
  "brwikisource": "br",
  "brwiktionary": "br",
  "bswiki": "bs",
  "bswikibooks": "bs",
  "bswikinews": "bs",
  "bswikiquote": "bs",
  "bswikisource": "bs",
  "bswiktionary": "bs",
  "bugwiki": "bug",
  "bxrwiki": "bxr",
  "cawiki": "ca",
  "cawikibooks": "ca",
  "cawikinews": "ca",
  "cawikiquote": "ca",
  "cawikisource": "ca",
  "cawiktionary": "ca",
  "cbk_zamwiki": "cbk-zam",
  "cdowiki": "cdo",
  "cebwiki": "ceb",
  "cewiki": "ce",
  "chowiki": "cho",
  "chrwiki": "chr",
  "chrwiktionary": "chr",
  "chwiki": "ch",
  "chwikibooks": "ch",
  "chwiktionary": "ch",
  "chywiki": "chy",
  "ckbwiki": "ckb",
  "cowiki": "co",
  "cowikibooks": "co",
  "cowikiquote": "co",
  "cowiktionary": "co",
  "crhwiki": "crh",
  "crwiki": "cr",
  "crwikiquote": "cr",
  "crwiktionary": "cr",
  "csbwiki": "csb",
  "csbwiktionary": "csb",
  "cswiki": "cs",
  "cswikibooks": "cs",
  "cswikinews": "cs",
  "cswikiquote": "cs",
  "cswikisource": "cs",
  "cswikiversity": "cs",
  "cswiktionary": "cs",
  "cuwiki": "cu",
  "cvwiki": "cv",
  "cvwikibooks": "cv",
  "cywiki": "cy",
  "cywikibooks": "cy",
  "cywikiquote": "cy",
  "cywikisource": "cy",
  "cywiktionary": "cy",
  "dagwiki": "dag",
  "dawiki": "da",
  "dawikibooks": "da",
  "dawikiquote": "da",
  "dawikisource": "da",
  "dawiktionary": "da",
  "dewiki": "de",
  "dewikibooks": "de",
  "dewikinews": "de",
  "dewikiquote": "de",
  "dewikisource": "de",
  "dewikiversity": "de",
  "dewikivoyage": "de",
  "dewiktionary": "de",
  "dinwiki": "din",
  "diqwiki": "diq",
  "diqwiktionary": "diq",
  "dsbwiki": "dsb",
  "dtywiki": "dty",
  "dvwiki": "dv",
  "dvwiktionary": "dv",
  "dzwiki": "dz",
  "dzwiktionary": "dz",
  "eewiki": "ee",
  "elwiki": "el",
  "elwikibooks": "el",
  "elwikinews": "el",
  "elwikiquote": "el",
  "elwikisource": "el",
  "elwikiversity": "el",
  "elwikivoyage": "el",
  "elwiktionary": "el",
  "emlwiki": "eml",
  "enwiki": "en",
  "enwikibooks": "en",
  "enwikinews": "en",
  "enwikiquote": "en",
  "enwikisource": "en",
  "enwikiversity": "en",
  "enwikivoyage": "en",
  "enwiktionary": "en",
  "eowiki": "eo",
  "eowikibooks": "eo",
  "eowikinews": "eo",
  "eowikiquote": "eo",
  "eowikisource": "eo",
  "eowikivoyage": "eo",
  "eowiktionary": "eo",
  "eswiki": "es",
  "eswikibooks": "es",
  "eswikinews": "es",
  "eswikiquote": "es",
  "eswikisource": "es",
  "eswikiversity": "es",
  "eswikivoyage": "es",
  "eswiktionary": "es",
  "etwiki": "et",
  "etwikibooks": "et",
  "etwikiquote": "et",
  "etwikisource": "et",
  "etwiktionary": "et",
  "euwiki": "eu",
  "euwikibooks": "eu",
  "euwikiquote": "eu",
  "euwikisource": "eu",
  "euwiktionary": "eu",
  "extwiki": "ext",
  "fawiki": "fa",
  "fawikibooks": "fa",
  "fawikinews": "fa",
  "fawikiquote": "fa",
  "fawikisource": "fa",
  "fawikivoyage": "fa",
  "fawiktionary": "fa",
  "ffwiki": "ff",
  "fiu_vrowiki": "fiu-vro",
  "fiwiki": "fi",
  "fiwikibooks": "fi",
  "fiwikinews": "fi",
  "fiwikiquote": "fi",
  "fiwikisource": "fi",
  "fiwikiversity": "fi",
  "fiwikivoyage": "fi",
  "fiwiktionary": "fi",
  "fjwiki": "fj",
  "fjwiktionary": "fj",
  "fowiki": "fo",
  "fowikisource": "fo",
  "fowiktionary": "fo",
  "frpwiki": "frp",
  "frrwiki": "frr",
  "frwiki": "fr",
  "frwikibooks": "fr",
  "frwikinews": "fr",
  "frwikiquote": "fr",
  "frwikisource": "fr",
  "frwikiversity": "fr",
  "frwikivoyage": "fr",
  "frwiktionary": "fr",
  "furwiki": "fur",
  "fywiki": "fy",
  "fywikibooks": "fy",
  "fywiktionary": "fy",
  "gagwiki": "gag",
  "ganwiki": "gan",
  "gawiki": "ga",
  "gawikibooks": "ga",
  "gawikiquote": "ga",
  "gawiktionary": "ga",
  "gcrwiki": "gcr",
  "gdwiki": "gd",
  "gdwiktionary": "gd",
  "glkwiki": "glk",
  "glwiki": "gl",
  "glwikibooks": "gl",
  "glwikiquote": "gl",
  "glwikisource": "gl",
  "glwiktionary": "gl",
  "gnwiki": "gn",
  "gnwikibooks": "gn",
  "gnwiktionary": "gn",
  "gomwiki": "gom",
  "gomwiktionary": "gom",
  "gorwiki": "gor",
  "gorwiktionary": "gor",
  "gotwiki": "got",
  "gotwikibooks": "got",
  "guwiki": "gu",
  "guwikibooks": "gu",
  "guwikiquote": "gu",
  "guwikisource": "gu",
  "guwiktionary": "gu",
  "guwwiki": "guw",
  "guwwikiquote": "guw",
  "guwwiktionary": "guw",
  "gvwiki": "gv",
  "gvwiktionary": "gv",
  "hakwiki": "hak",
  "hawiki": "ha",
  "hawiktionary": "ha",
  "hawwiki": "haw",
  "hewiki": "he",
  "hewikibooks": "he",
  "hewikinews": "he",
  "hewikiquote": "he",
  "hewikisource": "he",
  "hewikivoyage": "he",
  "hewiktionary": "he",
  "hifwiki": "hif",
  "hifwiktionary": "hif",
  "hiwiki": "hi",
  "hiwikibooks": "hi",
  "hiwikiquote": "hi",
  "hiwikisource": "hi",
  "hiwikiversity": "hi",
  "hiwikivoyage": "hi",
  "hiwiktionary": "hi",
  "howiki": "ho",
  "hrwiki": "hr",
  "hrwikibooks": "hr",
  "hrwikiquote": "hr",
  "hrwikisource": "hr",
  "hrwiktionary": "hr",
  "hsbwiki": "hsb",
  "hsbwiktionary": "hsb",
  "htwiki": "ht",
  "htwikisource": "ht",
  "huwiki": "hu",
  "huwikibooks": "hu",
  "huwikinews": "hu",
  "huwikiquote": "hu",
  "huwikisource": "hu",
  "huwiktionary": "hu",
  "hywiki": "hy",
  "hywikibooks": "hy",
  "hywikiquote": "hy",
  "hywikisource": "hy",
  "hywiktionary": "hy",
  "hywwiki": "hyw",
  "hzwiki": "hz",
  "iawiki": "ia",
  "iawikibooks": "ia",
  "iawiktionary": "ia",
  "idwiki": "id",
  "idwikibooks": "id",
  "idwikiquote": "id",
  "idwikisource": "id",
  "idwiktionary": "id",
  "iewiki": "ie",
  "iewikibooks": "ie",
  "iewiktionary": "ie",
  "igwiki": "ig",
  "igwikiquote": "ig",
  "igwiktionary": "ig",
  "iiwiki": "ii",
  "ikwiki": "ik",
  "ikwiktionary": "ik",
  "ilowiki": "ilo",
  "inhwiki": "inh",
  "iowiki": "io",
  "iowiktionary": "io",
  "iswiki": "is",
  "iswikibooks": "is",
  "iswikiquote": "is",
  "iswikisource": "is",
  "iswiktionary": "is",
  "itwiki": "it",
  "itwikibooks": "it",
  "itwikinews": "it",
  "itwikiquote": "it",
  "itwikisource": "it",
  "itwikiversity": "it",
  "itwikivoyage": "it",
  "itwiktionary": "it",
  "iuwiki": "iu",
  "iuwiktionary": "iu",
  "jamwiki": "jam",
  "jawiki": "ja",
  "jawikibooks": "ja",
  "jawikinews": "ja",
  "jawikiquote": "ja",
  "jawikisource": "ja",
  "jawikiversity": "ja",
  "jawikivoyage": "ja",
  "jawiktionary": "ja",
  "jbowiki": "jbo",
  "jbowiktionary": "jbo",
  "jvwiki": "jv",
  "jvwikisource": "jv",
  "jvwiktionary": "jv",
  "kaawiki": "kaa",
  "kabwiki": "kab",
  "kawiki": "ka",
  "kawikibooks": "ka",
  "kawikiquote": "ka",
  "kawiktionary": "ka",
  "kbdwiki": "kbd",
  "kbpwiki": "kbp",
  "kcgwiki": "kcg",
  "kgwiki": "kg",
  "kiwiki": "ki",
  "kjwiki": "kj",
  "kkwiki": "kk",
  "kkwikibooks": "kk",
  "kkwikiquote": "kk",
  "kkwiktionary": "kk",
  "klwiki": "kl",
  "klwiktionary": "kl",
  "kmwiki": "km",
  "kmwikibooks": "km",
  "kmwiktionary": "km",
  "knwiki": "kn",
  "knwikibooks": "kn",
  "knwikiquote": "kn",
  "knwikisource": "kn",
  "knwiktionary": "kn",
  "koiwiki": "koi",
  "kowiki": "ko",
  "kowikibooks": "ko",
  "kowikinews": "ko",
  "kowikiquote": "ko",
  "kowikisource": "ko",
  "kowikiversity": "ko",
  "kowiktionary": "ko",
  "krcwiki": "krc",
  "krwiki": "kr",
  "krwikiquote": "kr",
  "kshwiki": "ksh",
  "kswiki": "ks",
  "kswikibooks": "ks",
  "kswikiquote": "ks",
  "kswiktionary": "ks",
  "kuwiki": "ku",
  "kuwikibooks": "ku",
  "kuwikiquote": "ku",
  "kuwiktionary": "ku",
  "kvwiki": "kv",
  "kwwiki": "kw",
  "kwwikiquote": "kw",
  "kwwiktionary": "kw",
  "kywiki": "ky",
  "kywikibooks": "ky",
  "kywikiquote": "ky",
  "kywiktionary": "ky",
  "ladwiki": "lad",
  "lawiki": "la",
  "lawikibooks": "la",
  "lawikiquote": "la",
  "lawikisource": "la",
  "lawiktionary": "la",
  "lbewiki": "lbe",
  "lbwiki": "lb",
  "lbwikibooks": "lb",
  "lbwikiquote": "lb",
  "lbwiktionary": "lb",
  "lezwiki": "lez",
  "lfnwiki": "lfn",
  "lgwiki": "lg",
  "lijwiki": "lij",
  "lijwikisource": "lij",
  "liwiki": "li",
  "liwikibooks": "li",
  "liwikinews": "li",
  "liwikiquote": "li",
  "liwikisource": "li",
  "liwiktionary": "li",
  "lldwiki": "lld",
  "lmowiki": "lmo",
  "lmowiktionary": "lmo",
  "lnwiki": "ln",
  "lnwikibooks": "ln",
  "lnwiktionary": "ln",
  "lowiki": "lo",
  "lowiktionary": "lo",
  "lrcwiki": "lrc",
  "ltgwiki": "ltg",
  "ltwiki": "lt",
  "ltwikibooks": "lt",
  "ltwikiquote": "lt",
  "ltwikisource": "lt",
  "ltwiktionary": "lt",
  "lvwiki": "lv",
  "lvwikibooks": "lv",
  "lvwiktionary": "lv",
  "madwiki": "mad",
  "maiwiki": "mai",
  "map_bmswiki": "map-bms",
  "mdfwiki": "mdf",
  "mgwiki": "mg",
  "mgwikibooks": "mg",
  "mgwiktionary": "mg",
  "mhrwiki": "mhr",
  "mhwiki": "mh",
  "mhwiktionary": "mh",
  "minwiki": "min",
  "minwiktionary": "min",
  "miwiki": "mi",
  "miwikibooks": "mi",
  "miwiktionary": "mi",
  "mkwiki": "mk",
  "mkwikibooks": "mk",
  "mkwikisource": "mk",
  "mkwiktionary": "mk",
  "mlwiki": "ml",
  "mlwikibooks": "ml",
  "mlwikiquote": "ml",
  "mlwikisource": "ml",
  "mlwiktionary": "ml",
  "mniwiki": "mni",
  "mniwiktionary": "mni",
  "mnwiki": "mn",
  "mnwikibooks": "mn",
  "mnwiktionary": "mn",
  "mnwwiki": "mnw",
  "mnwwiktionary": "mnw",
  "mrjwiki": "mrj",
  "mrwiki": "mr",
  "mrwikibooks": "mr",
  "mrwikiquote": "mr",
  "mrwikisource": "mr",
  "mrwiktionary": "mr",
  "mswiki": "ms",
  "mswikibooks": "ms",
  "mswiktionary": "ms",
  "mtwiki": "mt",
  "mtwiktionary": "mt",
  "muswiki": "mus",
  "mwlwiki": "mwl",
  "myvwiki": "myv",
  "mywiki": "my",
  "mywikibooks": "my",
  "mywiktionary": "my",
  "mznwiki": "mzn",
  "nahwiki": "nah",
  "nahwikibooks": "nah",
  "nahwiktionary": "nah",
  "napwiki": "nap",
  "napwikisource": "nap",
  "nawiki": "na",
  "nawikibooks": "na",
  "nawikiquote": "na",
  "nawiktionary": "na",
  "nds_nlwiki": "nds-nl",
  "ndswiki": "nds",
  "ndswikibooks": "nds",
  "ndswikiquote": "nds",
  "ndswiktionary": "nds",
  "newiki": "ne",
  "newikibooks": "ne",
  "newiktionary": "ne",
  "newwiki": "new",
  "ngwiki": "ng",
  "niawiki": "nia",
  "niawiktionary": "nia",
  "nlwiki": "nl",
  "nlwikibooks": "nl",
  "nlwikinews": "nl",
  "nlwikiquote": "nl",
  "nlwikisource": "nl",
  "nlwikivoyage": "nl",
  "nlwiktionary": "nl",
  "nnwiki": "nn",
  "nnwikiquote": "nn",
  "nnwiktionary": "nn",
  "novwiki": "nov",
  "nowiki": "no",
  "nowikibooks": "no",
  "nowikinews": "no",
  "nowikiquote": "no",
  "nowikisource": "no",
  "nowiktionary": "no",
  "nqowiki": "nqo",
  "nrmwiki": "nrm",
  "nsowiki": "nso",
  "nvwiki": "nv",
  "nywiki": "ny",
  "ocwiki": "oc",
  "ocwikibooks": "oc",
  "ocwiktionary": "oc",
  "olowiki": "olo",
  "omwiki": "om",
  "omwiktionary": "om",
  "orwiki": "or",
  "orwikisource": "or",
  "orwiktionary": "or",
  "oswiki": "os",
  "pagwiki": "pag",
  "pamwiki": "pam",
  "papwiki": "pap",
  "pawiki": "pa",
  "pawikibooks": "pa",
  "pawikisource": "pa",
  "pawiktionary": "pa",
  "pcdwiki": "pcd",
  "pcmwiki": "pcm",
  "pdcwiki": "pdc",
  "pflwiki": "pfl",
  "pihwiki": "pih",
  "piwiki": "pi",
  "piwiktionary": "pi",
  "plwiki": "pl",
  "plwikibooks": "pl",
  "plwikinews": "pl",
  "plwikiquote": "pl",
  "plwikisource": "pl",
  "plwikivoyage": "pl",
  "plwiktionary": "pl",
  "pmswiki": "pms",
  "pmswikisource": "pms",
  "pnbwiki": "pnb",
  "pnbwiktionary": "pnb",
  "pntwiki": "pnt",
  "pswiki": "ps",
  "pswikibooks": "ps",
  "pswikivoyage": "ps",
  "pswiktionary": "ps",
  "ptwiki": "pt",
  "ptwikibooks": "pt",
  "ptwikinews": "pt",
  "ptwikiquote": "pt",
  "ptwikisource": "pt",
  "ptwikiversity": "pt",
  "ptwikivoyage": "pt",
  "ptwiktionary": "pt",
  "pwnwiki": "pwn",
  "quwiki": "qu",
  "quwikibooks": "qu",
  "quwikiquote": "qu",
  "quwiktionary": "qu",
  "rmwiki": "rm",
  "rmwikibooks": "rm",
  "rmwiktionary": "rm",
  "rmywiki": "rmy",
  "rnwiki": "rn",
  "rnwiktionary": "rn",
  "roa_rupwiki": "roa-rup",
  "roa_rupwiktionary": "roa-rup",
  "roa_tarawiki": "roa-tara",
  "rowiki": "ro",
  "rowikibooks": "ro",
  "rowikinews": "ro",
  "rowikiquote": "ro",
  "rowikisource": "ro",
  "rowikivoyage": "ro",
  "rowiktionary": "ro",
  "ruewiki": "rue",
  "ruwiki": "ru",
  "ruwikibooks": "ru",
  "ruwikinews": "ru",
  "ruwikiquote": "ru",
  "ruwikisource": "ru",
  "ruwikiversity": "ru",
  "ruwikivoyage": "ru",
  "ruwiktionary": "ru",
  "rwwiki": "rw",
  "rwwiktionary": "rw",
  "sahwiki": "sah",
  "sahwikiquote": "sah",
  "sahwikisource": "sah",
  "satwiki": "sat",
  "sawiki": "sa",
  "sawikibooks": "sa",
  "sawikiquote": "sa",
  "sawikisource": "sa",
  "sawiktionary": "sa",
  "scnwiki": "scn",
  "scnwiktionary": "scn",
  "scowiki": "sco",
  "scwiki": "sc",
  "scwiktionary": "sc",
  "sdwiki": "sd",
  "sdwikinews": "sd",
  "sdwiktionary": "sd",
  "sewiki": "se",
  "sewikibooks": "se",
  "sgwiki": "sg",
  "sgwiktionary": "sg",
  "shiwiki": "shi",
  "shnwiki": "shn",
  "shnwikibooks": "shn",
  "shnwikivoyage": "shn",
  "shnwiktionary": "shn",
  "shwiki": "sh",
  "shwiktionary": "sh",
  "shywiktionary": "shy",
  "simplewiki": "simple",
  "simplewikibooks": "simple",
  "simplewikiquote": "simple",
  "simplewiktionary": "simple",
  "siwiki": "si",
  "siwikibooks": "si",
  "siwiktionary": "si",
  "skrwiki": "skr",
  "skrwiktionary": "skr",
  "skwiki": "sk",
  "skwikibooks": "sk",
  "skwikiquote": "sk",
  "skwikisource": "sk",
  "skwiktionary": "sk",
  "slwiki": "sl",
  "slwikibooks": "sl",
  "slwikiquote": "sl",
  "slwikisource": "sl",
  "slwikiversity": "sl",
  "slwiktionary": "sl",
  "smnwiki": "smn",
  "smwiki": "sm",
  "smwiktionary": "sm",
  "snwiki": "sn",
  "snwiktionary": "sn",
  "sowiki": "so",
  "sowiktionary": "so",
  "sqwiki": "sq",
  "sqwikibooks": "sq",
  "sqwikinews": "sq",
  "sqwikiquote": "sq",
  "sqwiktionary": "sq",
  "srnwiki": "srn",
  "srwiki": "sr",
  "srwikibooks": "sr",
  "srwikinews": "sr",
  "srwikiquote": "sr",
  "srwikisource": "sr",
  "srwiktionary": "sr",
  "sswiki": "ss",
  "sswiktionary": "ss",
  "stqwiki": "stq",
  "stwiki": "st",
  "stwiktionary": "st",
  "suwiki": "su",
  "suwikibooks": "su",
  "suwikiquote": "su",
  "suwiktionary": "su",
  "svwiki": "sv",
  "svwikibooks": "sv",
  "svwikinews": "sv",
  "svwikiquote": "sv",
  "svwikisource": "sv",
  "svwikiversity": "sv",
  "svwikivoyage": "sv",
  "svwiktionary": "sv",
  "swwiki": "sw",
  "swwikibooks": "sw",
  "swwiktionary": "sw",
  "szlwiki": "szl",
  "szywiki": "szy",
  "tawiki": "ta",
  "tawikibooks": "ta",
  "tawikinews": "ta",
  "tawikiquote": "ta",
  "tawikisource": "ta",
  "tawiktionary": "ta",
  "taywiki": "tay",
  "tcywiki": "tcy",
  "tetwiki": "tet",
  "tewiki": "te",
  "tewikibooks": "te",
  "tewikiquote": "te",
  "tewikisource": "te",
  "tewiktionary": "te",
  "tgwiki": "tg",
  "tgwikibooks": "tg",
  "tgwiktionary": "tg",
  "thwiki": "th",
  "thwikibooks": "th",
  "thwikinews": "th",
  "thwikiquote": "th",
  "thwikisource": "th",
  "thwiktionary": "th",
  "tiwiki": "ti",
  "tiwiktionary": "ti",
  "tkwiki": "tk",
  "tkwikibooks": "tk",
  "tkwikiquote": "tk",
  "tkwiktionary": "tk",
  "tlwiki": "tl",
  "tlwikibooks": "tl",
  "tlwikiquote": "tl",
  "tlwiktionary": "tl",
  "tnwiki": "tn",
  "tnwiktionary": "tn",
  "towiki": "to",
  "towiktionary": "to",
  "tpiwiki": "tpi",
  "tpiwiktionary": "tpi",
  "trvwiki": "trv",
  "trwiki": "tr",
  "trwikibooks": "tr",
  "trwikinews": "tr",
  "trwikiquote": "tr",
  "trwikisource": "tr",
  "trwikivoyage": "tr",
  "trwiktionary": "tr",
  "tswiki": "ts",
  "tswiktionary": "ts",
  "ttwiki": "tt",
  "ttwikibooks": "tt",
  "ttwikiquote": "tt",
  "ttwiktionary": "tt",
  "tumwiki": "tum",
  "twwiki": "tw",
  "twwiktionary": "tw",
  "tyvwiki": "tyv",
  "tywiki": "ty",
  "udmwiki": "udm",
  "ugwiki": "ug",
  "ugwikibooks": "ug",
  "ugwikiquote": "ug",
  "ugwiktionary": "ug",
  "ukwiki": "uk",
  "ukwikibooks": "uk",
  "ukwikinews": "uk",
  "ukwikiquote": "uk",
  "ukwikisource": "uk",
  "ukwikivoyage": "uk",
  "ukwiktionary": "uk",
  "urwiki": "ur",
  "urwikibooks": "ur",
  "urwikiquote": "ur",
  "urwiktionary": "ur",
  "uzwiki": "uz",
  "uzwikibooks": "uz",
  "uzwikiquote": "uz",
  "uzwiktionary": "uz",
  "vecwiki": "vec",
  "vecwikisource": "vec",
  "vecwiktionary": "vec",
  "vepwiki": "vep",
  "vewiki": "ve",
  "viwiki": "vi",
  "viwikibooks": "vi",
  "viwikiquote": "vi",
  "viwikisource": "vi",
  "viwikivoyage": "vi",
  "viwiktionary": "vi",
  "vlswiki": "vls",
  "vowiki": "vo",
  "vowikibooks": "vo",
  "vowikiquote": "vo",
  "vowiktionary": "vo",
  "warwiki": "war",
  "wawiki": "wa",
  "wawikibooks": "wa",
  "wawikisource": "wa",
  "wawiktionary": "wa",
  "wowiki": "wo",
  "wowikiquote": "wo",
  "wowiktionary": "wo",
  "wuuwiki": "wuu",
  "xalwiki": "xal",
  "xhwiki": "xh",
  "xhwikibooks": "xh",
  "xhwiktionary": "xh",
  "xmfwiki": "xmf",
  "yiwiki": "yi",
  "yiwikisource": "yi",
  "yiwiktionary": "yi",
  "yowiki": "yo",
  "yowikibooks": "yo",
  "yowiktionary": "yo",
  "yuewiktionary": "yue",
  "zawiki": "za",
  "zawikibooks": "za",
  "zawikiquote": "za",
  "zawiktionary": "za",
  "zeawiki": "zea",
  "zh_classicalwiki": "zh-classical",
  "zh_min_nanwiki": "zh-min-nan",
  "zh_min_nanwikibooks": "zh-min-nan",
  "zh_min_nanwikiquote": "zh-min-nan",
  "zh_min_nanwikisource": "zh-min-nan",
  "zh_min_nanwiktionary": "zh-min-nan",
  "zh_yuewiki": "zh-yue",
  "zhwiki": "zh",
  "zhwikibooks": "zh",
  "zhwikinews": "zh",
  "zhwikiquote": "zh",
  "zhwikisource": "zh",
  "zhwikiversity": "zh",
  "zhwikivoyage": "zh",
  "zhwiktionary": "zh",
  "zuwiki": "zu",
  "zuwikibooks": "zu",
  "zuwiktionary": "zu"
}
