[
  "rowiki",
  "mniwiki",
  "plwiki",
  "lvwiki",
  "idwiktionary",
  "ukwikinews",
  "fawikivoyage",
  "mkwikibooks",
  "zh_min_nanwikiquote",
  "bawikibooks",
  "hywikiquote",
  "gawiki",
  "hrwiki",
  "liwikisource",
  "nywiki",
  "wuuwiki",
  "sawikibooks",
  "guwwiktionary",
  "skwiktionary",
  "ruewiki",
  "kwwiktionary",
  "lvwiktionary",
  "bjnwiki",
  "hywiktionary",
  "zhwikivoyage",
  "zh_yuewiki",
  "suwikibooks",
  "swwiktionary",
  "sowiktionary",
  "kawikibooks",
  "cebwiki",
  "napwikisource",
  "dtywiki",
  "sahwiki",
  "fjwiktionary",
  "pnbwiktionary",
  "fawikinews",
  "tawikibooks",
  "hsbwiktionary",
  "aywiktionary",
  "srwikinews",
  "nowikiquote",
  "jawiki",
  "kowikisource",
  "mywikibooks",
  "kmwikibooks",
  "simplewikiquote",
  "mswiktionary",
  "bclwikiquote",
  "akwikibooks",
  "bewiktionary",
  "afwikiquote",
  "lbwikiquote",
  "gvwiktionary",
  "pwnwiki",
  "jawikibooks",
  "slwikiquote",
  "tumwiki",
  "cbk_zamwiki",
  "hiwikivoyage",
  "miwikibooks",
  "omwiki",
  "zh_min_nanwiki",
  "enwiki",
  "arwikibooks",
  "zhwikiquote",
  "mnwikibooks",
  "alswiki",
  "frwikiversity",
  "lbewiki",
  "mkwiki",
  "trvwiki",
  "pcdwiki",
  "bnwiktionary",
  "mrwiki",
  "jbowiki",
  "cawikibooks",
  "ikwiktionary",
  "orwiki",
  "mznwiki",
  "hywikibooks",
  "biwiktionary",
  "stqwiki",
  "simplewiki",
  "krwiki",
  "nlwikibooks",
  "chwikibooks",
  "scnwiki",
  "gawikibooks",
  "idwikibooks",
  "kkwiktionary",
  "shnwiktionary",
  "euwiktionary",
  "hewikiquote",
  "dewiki",
  "tnwiktionary",
  "shnwiki",
  "lbwikibooks",
  "kbpwiki",
  "kbdwiki",
  "gvwiki",
  "viwiki",
  "lijwikisource",
  "zeawiki",
  "vecwikisource",
  "guwwiki",
  "trwikivoyage",
  "idwikiquote",
  "slwikisource",
  "nawiki",
  "svwiki",
  "liwikibooks",
  "viwikisource",
  "aywiki",
  "huwikisource",
  "tswiki",
  "gotwikibooks",
  "arwiktionary",
  "frwikibooks",
  "ruwikinews",
  "urwiktionary",
  "towiktionary",
  "ltgwiki",
  "mrjwiki",
  "lijwiki",
  "thwikisource",
  "svwiktionary",
  "hifwiki",
  "pflwiki",
  "cswikibooks",
  "glkwiki",
  "kabwiki",
  "roa_rupwiktionary",
  "ltwikibooks",
  "mrwikiquote",
  "uzwikiquote",
  "muswiki",
  "bgwikinews",
  "liwikinews",
  "emlwiki",
  "quwikibooks",
  "vowikibooks",
  "etwikisource",
  "hrwikibooks",
  "roa_tarawiki",
  "cuwiki",
  "kgwiki",
  "azwikisource",
  "chwiktionary",
  "kawikiquote",
  "nlwikinews",
  "tewikisource",
  "eswikivoyage",
  "anwiki",
  "viwikiquote",
  "gomwiki",
  "aywikibooks",
  "mwlwiki",
  "szywiki",
  "htwikisource",
  "mywiki",
  "cdowiki",
  "iswikisource",
  "kywikibooks",
  "astwiktionary",
  "lnwiki",
  "eowiki",
  "yowikibooks",
  "hakwiki",
  "csbwiktionary",
  "skrwiki",
  "hewikisource",
  "ttwikiquote",
  "sgwiktionary",
  "enwiktionary",
  "etwikiquote",
  "etwiki",
  "ocwikibooks",
  "rmwikibooks",
  "mniwiktionary",
  "frwikisource",
  "zhwikibooks",
  "lbwiki",
  "simplewikibooks",
  "fiwikiversity",
  "brwiki",
  "zh_min_nanwikibooks",
  "wowiki",
  "pawikisource",
  "mgwiktionary",
  "dagwiki",
  "mywiktionary",
  "piwiktionary",
  "mlwikisource",
  "nowiki",
  "iuwiki",
  "jawikiquote",
  "itwikibooks",
  "ltwikisource",
  "siwiki",
  "jvwiki",
  "tawikinews",
  "knwikisource",
  "vowikiquote",
  "sswiktionary",
  "etwikibooks",
  "svwikiversity",
  "hiwikiversity",
  "pnbwiki",
  "pmswiki",
  "fawikibooks",
  "sewiki",
  "eowikivoyage",
  "inhwiki",
  "iewiki",
  "ckbwiki",
  "cvwiki",
  "rowikinews",
  "sqwiki",
  "cswiki",
  "chowiki",
  "gcrwiki",
  "chrwiki",
  "itwikiversity",
  "trwikibooks",
  "sswiki",
  "tgwiktionary",
  "olowiki",
  "itwikinews",
  "tnwiki",
  "akwiktionary",
  "igwikiquote",
  "angwiktionary",
  "amwiktionary",
  "angwikiquote",
  "mswikibooks",
  "hrwikisource",
  "kowikiversity",
  "bgwiktionary",
  "plwikiquote",
  "kkwikibooks",
  "jvwikisource",
  "ukwiki",
  "fawikiquote",
  "newwiki",
  "dzwiktionary",
  "amwiki",
  "siwikibooks",
  "elwikisource",
  "brwiktionary",
  "iiwiki",
  "mnwwiki",
  "frpwiki",
  "aawiki",
  "tkwiktionary",
  "dawiktionary",
  "fawiktionary",
  "extwiki",
  "guwikibooks",
  "frrwiki",
  "euwikiquote",
  "nowikisource",
  "gawiktionary",
  "bgwikisource",
  "rowikiquote",
  "bgwikiquote",
  "lmowiktionary",
  "newiki",
  "nowiktionary",
  "guwiktionary",
  "kywikiquote",
  "azwiki",
  "ltwiktionary",
  "fowiki",
  "rowikisource",
  "skwikisource",
  "kkwiki",
  "bswikisource",
  "jawikiversity",
  "hywikisource",
  "ruwikibooks",
  "suwiktionary",
  "elwikiversity",
  "svwikiquote",
  "chywiki",
  "tiwiktionary",
  "kaawiki",
  "mnwiktionary",
  "zuwikibooks",
  "howiki",
  "igwiktionary",
  "quwiki",
  "eowikisource",
  "dewikinews",
  "mswiki",
  "omwiktionary",
  "dawiki",
  "cswikinews",
  "elwikinews",
  "hywiki",
  "suwikiquote",
  "arwikinews",
  "amiwiki",
  "iawikibooks",
  "dewikibooks",
  "enwikisource",
  "iawiktionary",
  "tewiktionary",
  "bawiki",
  "rowikivoyage",
  "scowiki",
  "nnwiktionary",
  "niawiki",
  "awawiki",
  "taywiki",
  "ttwiki",
  "mtwiktionary",
  "jawiktionary",
  "bnwikivoyage",
  "iswikibooks",
  "ganwiki",
  "tywiki",
  "sqwikinews",
  "bmwikiquote",
  "avwiktionary",
  "vecwiki",
  "bat_smgwiki",
  "bjnwiktionary",
  "scwiki",
  "iswiktionary",
  "crhwiki",
  "tlwikibooks",
  "pswikivoyage",
  "kowikibooks",
  "scwiktionary",
  "angwikibooks",
  "trwikinews",
  "snwiki",
  "glwikiquote",
  "enwikiquote",
  "kuwikibooks",
  "tkwikibooks",
  "bewikisource",
  "cywiki",
  "kvwiki",
  "bewikibooks",
  "nlwiktionary",
  "aawiktionary",
  "ugwikibooks",
  "bmwiktionary",
  "yuewiktionary",
  "sewikibooks",
  "wawikibooks",
  "plwikinews",
  "avkwiki",
  "sawiki",
  "fowiktionary",
  "rnwiki",
  "lawikiquote",
  "cowikiquote",
  "kswiktionary",
  "hrwikiquote",
  "liwikiquote",
  "glwikibooks",
  "kshwiki",
  "nahwiki",
  "adywiki",
  "ndswikiquote",
  "vlswiki",
  "fiu_vrowiki",
  "hiwiktionary",
  "shwiki",
  "lnwikibooks",
  "fiwikivoyage",
  "vecwiktionary",
  "iewikibooks",
  "wawiki",
  "minwiktionary",
  "ladwiki",
  "zuwiki",
  "vewiki",
  "itwiki",
  "elwikiquote",
  "nnwiki",
  "dawikisource",
  "tgwiki",
  "fjwiki",
  "abwiktionary",
  "rmywiki",
  "ngwiki",
  "cewiki",
  "bclwiki",
  "tswiktionary",
  "aswikibooks",
  "cywiktionary",
  "klwiktionary",
  "wawiktionary",
  "ugwiktionary",
  "zawikiquote",
  "mnwiki",
  "arcwiki",
  "bswiktionary",
  "mkwiktionary",
  "liwiktionary",
  "madwiki",
  "brwikiquote",
  "piwiki",
  "arwiki",
  "ilowiki",
  "cawikisource",
  "sqwikiquote",
  "ocwiki",
  "thwiki",
  "mrwiktionary",
  "fiwikiquote",
  "nahwikibooks",
  "nlwikiquote",
  "dinwiki",
  "zh_min_nanwikisource",
  "sdwiktionary",
  "eswikisource",
  "trwiki",
  "eswikibooks",
  "twwiki",
  "nawiktionary",
  "hewikibooks",
  "thwikibooks",
  "bnwiki",
  "ukwiktionary",
  "lezwiki",
  "pamwiki",
  "mrwikibooks",
  "frwiki",
  "ptwikiquote",
  "bmwiki",
  "aswiki",
  "azwiktionary",
  "trwiktionary",
  "xalwiki",
  "slwiktionary",
  "dzwiki",
  "brwikisource",
  "kuwiki",
  "towiki",
  "nahwiktionary",
  "ukwikiquote",
  "htwiki",
  "dewikivoyage",
  "bgwiki",
  "ruwiktionary",
  "xhwiki",
  "smwiktionary",
  "gagwiki",
  "slwikibooks",
  "plwikivoyage",
  "quwiktionary",
  "hewikinews",
  "tlwiki",
  "urwiki",
  "ruwiki",
  "klwiki",
  "csbwiki",
  "iuwiktionary",
  "bewiki",
  "warwiki",
  "euwiki",
  "frwikiquote",
  "huwikinews",
  "kmwiktionary",
  "astwiki",
  "lldwiki",
  "fawikisource",
  "zh_classicalwiki",
  "szlwiki",
  "miwiktionary",
  "svwikinews",
  "zawiki",
  "diqwiki",
  "yiwikisource",
  "ukwikivoyage",
  "vepwiki",
  "shnwikivoyage",
  "hywwiki",
  "amwikiquote",
  "sqwiktionary",
  "fywiki",
  "hiwiki",
  "skwikibooks",
  "euwikibooks",
  "twwiktionary",
  "kowiktionary",
  "jawikisource",
  "srwiki",
  "tkwiki",
  "snwiktionary",
  "crwiktionary",
  "bswikiquote",
  "nowikinews",
  "gomwiktionary",
  "iowiktionary",
  "lrcwiki",
  "cswiktionary",
  "fiwikinews",
  "stwiktionary",
  "huwikiquote",
  "orwiktionary",
  "be_x_oldwiki",
  "mlwiki",
  "tlwiktionary",
  "ptwiktionary",
  "knwiktionary",
  "hiwikiquote",
  "pawiktionary",
  "cvwikibooks",
  "tetwiki",
  "arywiki",
  "stwiki",
  "wowikiquote",
  "huwikibooks",
  "yowiki",
  "idwiki",
  "afwiktionary",
  "rwwiktionary",
  "ruwikisource",
  "tkwikiquote",
  "anwiktionary",
  "svwikisource",
  "fiwikisource",
  "srwikibooks",
  "iowiki",
  "map_bmswiki",
  "plwikibooks",
  "hzwiki",
  "bowiktionary",
  "kswikiquote",
  "bnwikisource",
  "koiwiki",
  "jbowiktionary",
  "cywikibooks",
  "xhwiktionary",
  "newiktionary",
  "hawwiki",
  "pswiktionary",
  "suwiki",
  "kywiktionary",
  "scnwiktionary",
  "jawikinews",
  "nqowiki",
  "lnwiktionary",
  "dawikiquote",
  "hawiktionary",
  "pswiki",
  "lawikisource",
  "hrwiktionary",
  "sahwikiquote",
  "lbwiktionary",
  "banwiki",
  "kuwiktionary",
  "astwikibooks",
  "nlwikisource",
  "yiwiktionary",
  "gdwiktionary",
  "guwikisource",
  "blkwiki",
  "nnwikiquote",
  "lawiki",
  "uzwiktionary",
  "tpiwiki",
  "orwikisource",
  "swwikibooks",
  "lfnwiki",
  "eswikiquote",
  "trwikiquote",
  "ndswiki",
  "gawikiquote",
  "novwiki",
  "thwikinews",
  "mgwiki",
  "liwiki",
  "nsowiki",
  "srwikiquote",
  "fiwikibooks",
  "enwikivoyage",
  "bswiki",
  "zhwikisource",
  "eewiki",
  "eowikibooks",
  "vowiktionary",
  "igwiki",
  "sowiki",
  "zhwikiversity",
  "ptwiki",
  "zawikibooks",
  "mrwikisource",
  "zhwiki",
  "dawikibooks",
  "banwikisource",
  "cywikisource",
  "idwikisource",
  "cawiktionary",
  "ugwikiquote",
  "enwikiversity",
  "srwiktionary",
  "nvwiki",
  "tiwiki",
  "fawiki",
  "afwikibooks",
  "bmwikibooks",
  "fywikibooks",
  "kmwiki",
  "mlwiktionary",
  "xmfwiki",
  "viwiktionary",
  "bpywiki",
  "aawikibooks",
  "zh_min_nanwiktionary",
  "pawiki",
  "kawiki",
  "itwikivoyage",
  "tewikibooks",
  "bxrwiki",
  "gnwiktionary",
  "knwikiquote",
  "chrwiktionary",
  "knwiki",
  "bnwikibooks",
  "viwikivoyage",
  "chwiki",
  "svwikivoyage",
  "frwikivoyage",
  "bgwikibooks",
  "gnwiki",
  "bswikibooks",
  "urwikibooks",
  "gotwiki",
  "satwiki",
  "zuwiktionary",
  "shywiktionary",
  "azwikibooks",
  "eowiktionary",
  "bowiki",
  "vowiki",
  "lmowiki",
  "pswikibooks",
  "acewiki",
  "svwikibooks",
  "gorwiki",
  "elwiki",
  "cswikisource",
  "tawikisource",
  "huwiki",
  "mdfwiki",
  "dewikiquote",
  "kwwiki",
  "ltwikiquote",
  "skwiki",
  "thwiktionary",
  "sahwikisource",
  "ptwikiversity",
  "slwikiversity",
  "hsbwiki",
  "itwiktionary",
  "rowiktionary",
  "mkwikisource",
  "fowikisource",
  "newikibooks",
  "pntwiki",
  "pawikibooks",
  "pihwiki",
  "simplewiktionary",
  "eswikinews",
  "niawiktionary",
  "minwiki",
  "uzwiki",
  "kowiki",
  "bhwiki",
  "wowiktionary",
  "ptwikisource",
  "kswikibooks",
  "sawikiquote",
  "swwiki",
  "rnwiktionary",
  "tewikiquote",
  "tyvwiki",
  "diqwiktionary",
  "kswiki",
  "aswikisource",
  "bhwiktionary",
  "fiwiktionary",
  "ukwikisource",
  "jawikivoyage",
  "thwikiquote",
  "ptwikivoyage",
  "elwiktionary",
  "bclwiktionary",
  "hawiki",
  "dewikiversity",
  "furwiki",
  "frwiktionary",
  "mnwwiktionary",
  "angwiki",
  "hiwikibooks",
  "wawikisource",
  "hewikivoyage",
  "krwikiquote",
  "lowiki",
  "kowikiquote",
  "azwikiquote",
  "tpiwiktionary",
  "slwiki",
  "atjwiki",
  "hiwikisource",
  "guwiki",
  "kjwiki",
  "nrmwiki",
  "kuwikiquote",
  "miwiki",
  "rowikibooks",
  "oswiki",
  "dvwiktionary",
  "nawikiquote",
  "akwiki",
  "bowikibooks",
  "dvwiki",
  "zhwikinews",
  "iswikiquote",
  "cowikibooks",
  "roa_rupwiki",
  "iswiki",
  "guwikiquote",
  "siwiktionary",
  "nowikibooks",
  "smnwiki",
  "skwikiquote",
  "myvwiki",
  "uzwikibooks",
  "bswikinews",
  "hewiki",
  "nds_nlwiki",
  "ocwiktionary",
  "tgwikibooks",
  "nlwikivoyage",
  "srwikisource",
  "cowiki",
  "udmwiki",
  "tcywiki",
  "papwiki",
  "dewiktionary",
  "ptwikibooks",
  "azbwiki",
  "pcmwiki",
  "iawiki",
  "eswiktionary",
  "lowiktionary",
  "abwiki",
  "yowiktionary",
  "ruwikiversity",
  "mlwikiquote",
  "mgwikibooks",
  "etwiktionary",
  "arwikisource",
  "pmswikisource",
  "nlwiki",
  "nawikibooks",
  "kywiki",
  "skrwiktionary",
  "glwiki",
  "shiwiki",
  "tewiki",
  "quwikiquote",
  "mhrwiki",
  "gnwikibooks",
  "cowiktionary",
  "sdwikinews",
  "avwiki",
  "mhwiktionary",
  "biwikibooks",
  "bugwiki",
  "eowikiquote",
  "sgwiki",
  "arwikiversity",
  "bewikiquote",
  "cswikiversity",
  "krcwiki",
  "viwikibooks",
  "zhwiktionary",
  "rmwiktionary",
  "kawiktionary",
  "elwikivoyage",
  "srnwiki",
  "eswiki",
  "sawiktionary",
  "sawikisource",
  "ikwiki",
  "rmwiki",
  "ruwikiquote",
  "smwiki",
  "itwikisource",
  "gdwiki",
  "arwikiquote",
  "tawiktionary",
  "angwikisource",
  "napwiki",
  "jvwiktionary",
  "eswikiversity",
  "sqwikibooks",
  "dewikisource",
  "bnwikiquote",
  "hifwiktionary",
  "rwwiki",
  "plwikisource",
  "ffwiki",
  "ttwikibooks",
  "ugwiki",
  "euwikisource",
  "shwiktionary",
  "kkwikiquote",
  "plwiktionary",
  "crwikiquote",
  "lgwiki",
  "itwikiquote",
  "yiwiki",
  "urwikiquote",
  "xhwikibooks",
  "trwikisource",
  "pdcwiki",
  "lawikibooks",
  "elwikibooks",
  "enwikibooks",
  "maiwiki",
  "ruwikivoyage",
  "kowikinews",
  "ukwikibooks",
  "cawikinews",
  "kwwikiquote",
  "crwiki",
  "ttwiktionary",
  "frwikinews",
  "cswikiquote",
  "pagwiki",
  "mhwiki",
  "barwiki",
  "kcgwiki",
  "lawiktionary",
  "biwiki",
  "dsbwiki",
  "ptwikinews",
  "cywikiquote",
  "mlwikibooks",
  "aswiktionary",
  "tawiki",
  "hewiktionary",
  "glwikisource",
  "arzwiki",
  "lvwikibooks",
  "iewiktionary",
  "cawiki",
  "ndswikibooks",
  "altwiki",
  "ltwiki",
  "tawikiquote",
  "mtwiki",
  "sdwiki",
  "huwiktionary",
  "fiwiki",
  "enwikinews",
  "knwikibooks",
  "cawikiquote",
  "zawiktionary",
  "jamwiki",
  "ndswiktionary",
  "tlwikiquote",
  "fywiktionary",
  "kiwiki",
  "eowikinews",
  "astwikiquote",
  "glwiktionary",
  "afwiki"
]
