{ "type": "articles", "identifier": "/enwiki/Earth" }
{ "name": "Earth", "date_modified":"2021-08-31T04:51:39Z", "identifier": 1, "is_part_of": { "identifier":"enwiki" }, "version": { "identifier": 1, "editor": { "name": "Test name" } }, "namespace": { "identifier": 0, "name": "test" }, "event": { "type": "update" } }

{ "type": "articles", "identifier": "/enwiki/Ninja" }
{ "name": "Ninja", "date_modified":"2021-08-31T04:51:39Z", "identifier": 2,  "is_part_of": { "identifier":"enwiki" }, "version": { "identifier": 1, "editor": { "name": "Test name" } }, "namespace": { "identifier": 0, "name": "test" }, "event": { "type": "update" } }

{ "type": "articles", "identifier": "/enwiki/Lionel_Messi" }
{ "name": "Lionel_Messi", "date_modified":"2021-08-31T04:51:39Z", "identifier": 3, "is_part_of": { "identifier":"enwiki" }, "version": { "identifier": 1, "editor": { "name": "Test name" } }, "namespace": { "identifier": 0, "name": "test" }, "event": { "type": "update" } }

{ "type": "articles", "identifier": "/enwiki/Maximiliano_Falcón" }
{ "name": "Maximiliano_Falcón", "date_modified":"2021-08-31T04:51:39Z", "identifier": 4, "is_part_of": { "identifier":"enwiki" }, "version": { "identifier": 1, "editor": { "name": "Test name" } }, "namespace": { "identifier": 0, "name": "test" }, "event": { "type": "update" } }

{ "type": "articles", "identifier": "/enwiki/Canadian_Open_(tennis)" }
{ "name": "Canadian_Open_(tennis)", "date_modified":"2021-08-31T04:51:39Z", "identifier": 5, "is_part_of": { "identifier":"enwiki" }, "version": { "identifier": 1, "editor": { "name": "Test name" } }, "namespace": { "identifier": 0, "name": "test" }, "event": { "type": "update" } }

{ "type": "articles", "identifier": "/eswiki/Masters_de_Canadá" }
{ "name": "Masters_de_Canadá", "date_modified":"2021-08-31T04:51:39Z", "identifier": 6, "is_part_of": { "identifier":"eswiki" }, "version": { "identifier": 1, "editor": { "name": "Test name" } }, "namespace": { "identifier": 0, "name": "test" }, "event": { "type": "update" } }