{ "type": "articles", "identifier": "/enwiki/Earth" }
{ "name": "Earth", "templates": [{"name": "Template:Ontario orchestras","url": "https://en.wikipedia.org/wiki/Template:Quebec_orchestras"}], "categories": [{"name": "Category:All articles with unsourced statements", "url": "https://en.wikipedia.org/wiki/Category:All_articles_with_unsourced_statements"}], "is_part_of": { "identifier":"enwiki" }, "in_language": {"identifier": "en"}, "protection": [{"type": "edit", "expiry": "never"}, {"type": "move", "expiry": "never"}], "namespace": { "identifier": 0 }, "version": { "identifier": 1, "tags": ["autoconfirmed", "mobileedit", "reverted"]}, "event": { "type": "update" }, "watchers_count": 20 }

{ "type": "articles", "identifier": "/enwiki/Ninja" }
{ "name": "Ninja", "is_part_of": { "identifier":"enwiki" }, "in_language": {"identifier": "en"}, "protection": [{"type": "edit", "expiry": "never"}, {"type": "move", "expiry": "never"}], "namespace": { "identifier": 0 }, "version": { "identifier": 1, "noindex": true }, "event": { "type": "create" },  "visibility": {"text": true}, "watchers_count": 20 }

{ "type": "articles", "identifier": "/enwiki/Lionel_Messi" }
{ "name": "Lionel_Messi", "is_part_of": { "identifier":"enwiki" }, "protection": [{"type": "edit", "expiry": "never"}, {"type": "move", "expiry": "never"}], "namespace": { "identifier": 0 }, "version": { "identifier": 1, "noindex": true  }, "event": { "type": "update" },  "visibility": {"text": false}, "watchers_count": 20 }

{ "type": "articles", "identifier": "/enwiki/Maximiliano_Falcón" }
{ "name": "Maximiliano_Falcón", "namespace": {"identifier": 0}, "date_modified": "2021-12-07T13:39:47Z", "is_part_of": { "identifier":"enwiki" }, "protection": [{"type": "edit", "expiry": "never"}, {"type": "move", "expiry": "never"}], "namespace": { "identifier": 0 }, "version": { "identifier": 1, "noindex": true  }, "event": { "type": "update" }, "watchers_count": 20 }

{ "type": "articles", "identifier": "/enwiki/Canadian_Open_(tennis)" }
{ "name": "Canadian_Open_(tennis)", "namespace": {"identifier": 0},"date_created": "2021-12-07T13:39:47Z", "abstract":"2022 विटैलिटी", "is_part_of": { "identifier":"enwiki" }, "protection": [{"type": "edit", "expiry": "never"}, {"type": "move", "expiry": "never"}], "namespace": { "identifier": 0 }, "version": { "identifier": 1, "noindex": true  }, "event": { "type": "update" }, "visibility": {"text": false} }

{ "type": "articles", "identifier": "/eswiki/Masters_de_Canadá" }
{ "name": "Masters_de_Canadá", "namespace": {"identifier": 0}, "is_part_of": { "identifier":"eswiki" }, "protection": [{"type": "edit", "expiry": "never"}, {"type": "move", "expiry": "never"}], "namespace": { "identifier": 0 }, "version": { "identifier": 1, "noindex": true  }, "event": { "type": "update" } }

{ "type": "articles", "identifier": "/eswiki/Camila_Giorgi" }
{ "name": "Camila_Giorgi", "in_language": {"identifier": "en"}, "namespace": {"identifier": 0}, "is_part_of": { "identifier":"eswiki" }, "protection": [{"type": "edit", "expiry": "never"}, {"type": "move", "expiry": "never"}], "namespace": { "identifier": 0 }, "version": { "identifier": 1, "noindex": true  }, "event": { "type": "update" } }

{ "type": "articles", "identifier": "/eswiki/Jeff_Borowiak" }
{ "name": "Jeff_Borowiak", "in_language": {"identifier": "en"},  "is_part_of": { "identifier":"eswiki" }, "protection": [{"type": "edit", "expiry": "never"}, {"type": "move", "expiry": "never"}], "namespace": { "identifier": 0 }, "version": { "identifier": 1, "noindex": true  }, "event": { "type": "update" } }

{ "type": "articles", "identifier": "/eswiki/Rafael_Nadal" }
{ "name": "Rafael_Nadal", "is_part_of": { "identifier":"eswiki" }, "protection": [{"type": "edit", "expiry": "never"}, {"type": "move", "expiry": "never"}], "namespace": { "identifier": 0 }, "version": { "identifier": 1 }, "event": { "type": "update" } }

{ "type": "articles", "identifier": "/enwiki/Orlando,_Florida" }
{ "name": "Orlando,_Florida", "in_language": {"identifier": "en"}, "is_part_of": { "identifier":"enwiki" }, "protection": [{"type": "edit", "expiry": "never"}, {"type": "move", "expiry": "never"}], "namespace": { "identifier": 0 }, "version": { "identifier": 1, "noindex": true  }, "event": { "type": "update" } }

{ "type": "articles", "identifier": "/eswiki/Guerra_de_las_Malvinas" }
{ "name": "Guerra_de_las_Malvinas", "in_language": {"identifier": "en"}, "is_part_of": { "identifier":"eswiki" }, "protection": [{"type": "edit", "expiry": "never"}, {"type": "move", "expiry": "never"}], "namespace": { "identifier": 0 }, "version": { "identifier": 1 }, "event": { "type": "update" } }

{ "type": "articles", "identifier": "/enwiki/Attack_on_Pearl_Harbor" }
{ "name": "Attack_on_Pearl_Harbor", "is_part_of": { "identifier":"enwiki" }, "protection": [{"type": "edit", "expiry": "never"}, {"type": "move", "expiry": "never"}], "namespace": { "identifier": 0 }, "version": { "identifier": 1, "tags": ["autoconfirmed"] }, "event": { "type": "update" } }

{ "type": "articles", "identifier": "/enwiki/Linguistic_relativity" }
{ "name": "Linguistic_relativity", "additional_entities": [{"identifier": "Q15958711"}], "is_part_of": { "identifier":"enwiki" }, "protection": [{"type": "edit", "expiry": "never"}, {"type": "move", "expiry": "never"}], "namespace": { "identifier": 0 }, "version": { "identifier": 1, "tags": ["autoconfirmed"] }, "event": { "type": "update" } }

{ "type": "articles", "identifier": "/enwiki/Geoffrey_K._Pullum" }
{ "name": "Geoffrey_K._Pullum", "additional_entities": [{"identifier": "Q15958711"}],"is_part_of": { "identifier":"enwiki" }, "protection": [{"type": "edit", "expiry": "never"}, {"type": "move", "expiry": "never"}],"namespace": { "identifier": 0 }, "version": { "identifier": 1, "tags": ["autoconfirmed"] }, "event": { "type": "update" } }

{ "type": "articles", "identifier": "/enwiki/Elon_Musk" }
{ "name": "Elon_Musk", "additional_entities": [{"identifier": "Q15958711"}],"is_part_of": { "identifier":"enwiki" },  "protection": [{"type": "edit", "expiry": "never"}, {"type": "move", "expiry": "never"}], "namespace": { "identifier": 0 }, "version": { "identifier": 1, "tags": ["autoconfirmed"] }, "event": { "type": "update" } }

{ "type": "articles", "identifier": "/enwiki/Hurricane_Ida" }
{ "name": "Hurricane_Ida", "additional_entities": [{"identifier": "Q15958711"}],"is_part_of": { "identifier":"enwiki" }, "protection": [{"type": "edit", "expiry": "never"}, {"type": "move", "expiry": "never"}], "namespace": { "identifier": 0 }, "version": { "identifier": 1, "tags": ["autoconfirmed"] }, "event": { "type": "update" } }

{ "type": "articles", "identifier": "/enwiki/Hurricane_Andrew" }
{ "name": "Hurricane_Andrew", "additional_entities": [{"identifier": "Q15958711"}],"is_part_of": { "identifier":"enwiki" }, "protection": [{"type": "edit", "expiry": "never"}, {"type": "move", "expiry": "never"}], "namespace": { "identifier": 0 }, "version": { "identifier": 1, "tags": ["autoconfirmed"] }, "event": { "type": "update" } }

{ "type": "articles", "identifier": "/enwiki/Pascal's_wager" }
{ "name": "Pascal's_wager", "additional_entities": [{"identifier": "Q15958711"}], "is_part_of": { "identifier":"enwiki" }, "protection": [{"type": "edit", "expiry": "never"}, {"type": "move", "expiry": "never"}], "namespace": { "identifier": 0 }, "version": { "identifier": 1, "tags": ["autoconfirmed"] }, "event": { "type": "update" } }

{ "type": "articles", "identifier": "/enwiki/Magnoliopsida" }
{ "name": "Magnoliopsida", "additional_entities": [{"identifier": "Q15958711"}],"is_part_of": { "identifier":"enwiki" }, "protection": [{"type": "edit", "expiry": "never"}, {"type": "move", "expiry": "never"}], "namespace": { "identifier": 0 }, "version": { "identifier": 1, "tags": ["autoconfirmed"] }, "event": { "type": "update" } }

{ "type": "articles", "identifier": "/eswiki/Dicotyledoneae" }
{ "name": "Dicotyledoneae", "additional_entities": [{"identifier": "Q15958711"}],"is_part_of": { "identifier":"eswiki" }, "protection": [{"type": "edit", "expiry": "never"}, {"type": "move", "expiry": "never"}], "namespace": { "identifier": 0 }, "version": { "identifier": 1, "tags": ["autoconfirmed"] }, "event": { "type": "update" } }

{ "type": "articles", "identifier": "/enwiki/Jacuzzi_Boys" }
{ "name": "Jacuzzi_Boys", "additional_entities": [{"identifier": "Q15958711"}],"is_part_of": { "identifier":"enwiki" }, "protection": [{"type": "edit", "expiry": "never"}, {"type": "move", "expiry": "never"}],"namespace": { "identifier": 0 }, "version": { "identifier": 1, "tags": ["autoconfirmed"] }, "event": { "type": "update" } }

{ "type": "articles", "identifier": "/eswiki/Cannabis_(psicotrópico)" }
{ "name": "Cannabis_(psicotrópico)", "is_part_of": { "identifier":"eswiki" },"protection": [{"type": "edit", "expiry": "never"}, {"type": "move", "expiry": "never"}], "namespace": { "identifier": 0 }, "version": { "identifier": 1, "tags": ["autoconfirmed"] }, "event": { "type": "update" } }

{ "type": "articles", "identifier": "/enwiki/Las_Rosas,_Santa_Fe" }
{ "name": "Las_Rosas,_Santa_Fe", "is_part_of": { "identifier":"enwiki" }, "protection": [{"type": "edit", "expiry": "never"}, {"type": "move", "expiry": "never"}],"namespace": { "identifier": 0 }, "version": { "identifier": 1, "tags": ["autoconfirmed"] }, "event": { "type": "update" } }

{ "type": "articles", "identifier": "/enwiki/Flag_of_Singapore" }
{ "name": "Flag_of_Singapore", "templates": [{"name": "Template:Quebec orchestras","url": "https://en.wikipedia.org/wiki/Template:Quebec_orchestras"}],"is_part_of": { "identifier":"enwiki" }, "protection": [{"type": "edit", "expiry": "never"}, {"type": "move", "expiry": "never"}],"namespace": { "identifier": 0 }, "version": { "identifier": 1 }, "event": { "type": "update" } }

{ "type": "articles", "identifier": "/eswiki/Muerte_de_Ayrton_Senna" }
{ "name": "Muerte_de_Ayrton_Senna", "is_part_of": { "identifier":"eswiki" }, "protection": [{"type": "edit", "expiry": "never"}, {"type": "move", "expiry": "never"}],"namespace": { "identifier": 0 }, "version": { "identifier": 1, "tags": ["autoconfirmed"] }, "event": { "type": "update" } }

{ "type": "articles", "identifier": "/eswiki/Anexo:Anexo:Muertes_en_Fórmula_1" }
{ "name": "Anexo:Muertes_en_Fórmula_1", "templates": [{"name": "Template:Quebec orchestras","url": "https://en.wikipedia.org/wiki/Template:Quebec_orchestras"}], "is_part_of": { "identifier":"eswiki" }, "protection": [{"type": "edit", "expiry": "never"}, {"type": "move", "expiry": "never"}],"namespace": { "identifier": 0 }, "version": { "identifier": 1 }, "event": { "type": "update" } }

{ "type": "articles", "identifier": "/eswiki/Kim_Kardashian" }
{ "name": "Kim_Kardashian", "templates": [{"name": "Template:Quebec orchestras","url": "https://en.wikipedia.org/wiki/Template:Quebec_orchestras"}], "is_part_of": { "identifier":"eswiki" }, "namespace": { "identifier": 0 }, "version": { "identifier": 1, "tags": ["autoconfirmed"] }, "event": { "type": "update" } }

{ "type": "articles", "identifier": "/eswiki/Donald_Trump" }
{ "name": "Donald_Trump",  "templates": [{"name": "Template:Quebec orchestras","url": "https://en.wikipedia.org/wiki/Template:Quebec_orchestras"}], "is_part_of": { "identifier":"eswiki" }, "namespace": { "identifier": 0 }, "version": { "identifier": 1, "tags": ["autoconfirmed"] }, "event": { "type": "update" } }

{ "type": "articles", "identifier": "/enwiki/Public_hearings_of_the_United_States_House_Select_Committee_on_the_January_6_Attack" }
{ "name": "Public_hearings_of_the_United_States_House_Select_Committee_on_the_January_6_Attack", "is_part_of": { "identifier":"enwiki" }, "namespace": { "identifier": 0 }, "version": { "identifier": 1, "tags": ["autoconfirmed"] }, "event": { "type": "update" } }

{ "type": "articles", "identifier": "/eswiki/Guns_N'_Roses" }
{ "name": "Guns_N'_Roses", "templates": [{"name": "Template:Quebec orchestras","url": "https://en.wikipedia.org/wiki/Template:Quebec_orchestras"}],  "is_part_of": { "identifier":"eswiki" }, "namespace": { "identifier": 0 }, "version": { "identifier": 1, "tags": ["autoconfirmed"] }, "event": { "type": "update" } }

{ "type": "articles", "identifier": "/enwiki/Eminem" }
{ "name": "Eminem", "is_part_of": { "identifier":"enwiki" }, "namespace": { "identifier": 0 }, "version": { "identifier": 1 }, "event": { "type": "update" }, "visibility": {"text": true} }

{ "type": "articles", "identifier": "/eswiki/México" }
{ "name": "México", "is_part_of": { "identifier":"eswiki" }, "namespace": { "identifier": 0 }, "version": { "identifier": 1 }, "event": { "type": "update" }, "visibility": {"comment": false} }

{ "type": "articles", "identifier": "/eswiki/Libia" }
{ "name": "Libia", "is_part_of": { "identifier":"eswiki" }, "namespace": { "identifier": 0 }, "version": { "identifier": 1 }, "event": { "type": "update" }, "visibility": {"comment": false} }

{ "type": "articles", "identifier": "/enwiki/Canada" }
{ "name": "Canada", "is_part_of": { "identifier":"enwiki" }, "namespace": { "identifier": 0 }, "version": { "identifier": 1 }, "event": { "type": "update" }, "visibility": {"comment": false} }