{ "type": "articles", "identifier": "/enwiki/Earth" }
{ "name": "Earth", "is_part_of": { "identifier":"enwiki" }, "in_language": { "identifier": "en" }, "version": { "identifier": 1 }, "previous_version": { "identifier": 0 }, "namespace" : { "identifier" : 0 }, "event": { "type": "update" , "date_created":"2023-10-11T13:45:33.749328+01:00"}  }

{ "type": "articles", "identifier": "/ruwiki/BYPOL" }
{ "name": "BYPOL", "is_part_of": { "identifier":"ruwiki" }, "in_language": { "identifier": "ru" }, "version": { "identifier": 1 }, "previous_version": { "identifier": 0 }, "namespace" : { "identifier" : 0 }, "event": { "type": "update" , "date_created":"2023-10-11T13:45:33.749328+01:00"}  }

{ "type": "articles", "identifier": "/enwiki/Ninja" }
{ "name": "Ninja", "is_part_of": { "identifier":"enwiki" }, "in_language": { "identifier": "en" }, "version": { "identifier": 1 }, "previous_version": { "identifier": 0 }, "namespace" : { "identifier" : 0 }, "event": { "type": "create" , "date_created":"2023-10-11T13:45:33.749328+01:00"} }

{ "type": "articles", "identifier": "/enwiki/Lionel_Messi" }
{ "name": "Lionel_Messi", "is_part_of": { "identifier":"enwiki"}, "in_language": { "identifier": "en" }, "version": { "identifier": 1 }, "previous_version": { "identifier": 0 }, "namespace" : { "identifier" : 0 }, "event": { "type": "update", "date_created":"2023-10-11T13:45:33.749328+01:00"} }

{ "type": "articles", "identifier": "/enwiki/Maximiliano_Falcón" }
{ "name": "Maximiliano_Falcón", "is_part_of": { "identifier":"enwiki" }, "in_language": { "identifier": "en" }, "version": { "identifier": 1 }, "previous_version": { "identifier": 0 }, "namespace" : { "identifier" : 0 }, "event": { "type": "update", "date_created":"2023-10-11T13:45:33.749328+01:00"} }

{ "type": "articles", "identifier": "/enwiki/Canadian_Open_(tennis)" }
{ "name": "Canadian_Open_(tennis)", "is_part_of": { "identifier":"enwiki" }, "in_language": { "identifier": "en" }, "version": { "identifier": 1 }, "previous_version": { "identifier": 0 }, "namespace" : { "identifier" : 0 }, "event": { "type": "update", "date_created":"2023-10-11T13:45:33.749328+01:00"} }

{ "type": "articles", "identifier": "/eswiki/Masters_de_Canadá" }
{ "name": "Masters_de_Canadá", "is_part_of": { "identifier":"eswiki" }, "in_language": { "identifier": "es" }, "version": { "identifier": 1 }, "previous_version": { "identifier": 0 }, "namespace" : { "identifier" : 0 }, "event": { "type": "update", "date_created":"2023-10-11T13:45:33.749328+01:00"} }

{ "type": "articles", "identifier": "/eswiki/Camila_Giorgi" }
{ "name": "Camila_Giorgi", "is_part_of": { "identifier":"eswiki" }, "in_language": { "identifier": "es" }, "version": { "identifier": 1 }, "previous_version": { "identifier": 0 }, "namespace" : { "identifier" : 0 }, "event": { "type": "update", "date_created":"2023-10-11T13:45:33.749328+01:00"} }

{ "type": "articles", "identifier": "/eswiki/Jeff_Borowiak" }
{ "name": "Jeff_Borowiak", "is_part_of": { "identifier":"eswiki" }, "in_language": { "identifier": "es" }, "version": { "identifier": 1 }, "previous_version": { "identifier": 0 }, "namespace" : { "identifier" : 0 }, "event": { "type": "update", "date_created":"2023-10-11T13:45:33.749328+01:00"} }

{ "type": "articles", "identifier": "/eswiki/Rafael_Nadal" }
{ "name": "Rafael_Nadal", "is_part_of": { "identifier":"eswiki" }, "in_language": { "identifier": "es" }, "version": { "identifier": 1 }, "previous_version": { "identifier": 0 }, "namespace" : { "identifier" : 0 }, "event": { "type": "update", "date_created":"2023-10-11T13:45:33.749328+01:00"} }

{ "type": "articles", "identifier": "/enwiki/Orlando,_Florida" }
{ "name": "Orlando,_Florida", "is_part_of": { "identifier":"enwiki" }, "in_language": { "identifier": "en" }, "version": { "identifier": 1 }, "previous_version": { "identifier": 0 }, "namespace" : { "identifier" : 0 }, "event": { "type": "update", "date_created":"2023-10-11T13:45:33.749328+01:00"} }

{ "type": "articles", "identifier": "/eswiki/Guerra_de_las_Malvinas" }
{ "name": "Guerra_de_las_Malvinas", "is_part_of": { "identifier":"eswiki" }, "in_language": { "identifier": "es" }, "version": { "identifier": 1 }, "previous_version": { "identifier": 0 }, "namespace" : { "identifier" : 0 }, "event": { "type": "update", "date_created":"2023-10-11T13:45:33.749328+01:00"} }

{ "type": "articles", "identifier": "/enwiki/Attack_on_Pearl_Harbor" }
{ "name": "Attack_on_Pearl_Harbor", "is_part_of": { "identifier":"enwiki" }, "in_language": { "identifier": "en" }, "version": { "identifier": 1 }, "previous_version": { "identifier": 0 }, "namespace" : { "identifier" : 0 }, "event": { "type": "update", "date_created":"2023-10-11T13:45:33.749328+01:00"} }

{ "type": "articles", "identifier": "/enwiki/Linguistic_relativity" }
{ "name": "Linguistic_relativity", "is_part_of": { "identifier":"enwiki" }, "in_language": { "identifier": "en" }, "version": { "identifier": 1 }, "previous_version": { "identifier": 0 }, "namespace" : { "identifier" : 0 }, "event": { "type": "update", "date_created":"2023-10-11T13:45:33.749328+01:00"} }

{ "type": "articles", "identifier": "/enwiki/Geoffrey_K._Pullum" }
{ "name": "Geoffrey_K._Pullum", "is_part_of": { "identifier":"enwiki" }, "in_language": { "identifier": "en" }, "version": { "identifier": 1 }, "previous_version": { "identifier": 0 }, "namespace" : { "identifier" : 0 }, "event": { "type": "update", "date_created":"2023-10-11T13:45:33.749328+01:00"} }

{ "type": "articles", "identifier": "/enwiki/Elon_Musk" }
{ "name": "Elon_Musk", "is_part_of": { "identifier":"enwiki" }, "in_language": { "identifier": "en" }, "version": { "identifier": 1 }, "previous_version": { "identifier": 0 }, "namespace" : { "identifier" : 0 }, "event": { "type": "update", "date_created":"2023-10-11T13:45:33.749328+01:00"} }

{ "type": "articles", "identifier": "/enwiki/Hurricane_Ida" }
{ "name": "Hurricane_Ida", "is_part_of": { "identifier":"enwiki" }, "in_language": { "identifier": "en" }, "version": { "identifier": 1 }, "previous_version": { "identifier": 0 }, "namespace" : { "identifier" : 0 }, "event": { "type": "update", "date_created":"2023-10-11T13:45:33.749328+01:00"} }

{ "type": "articles", "identifier": "/enwiki/Hurricane_Andrew" }
{ "name": "Hurricane_Andrew", "is_part_of": { "identifier":"enwiki" }, "in_language": { "identifier": "en" }, "version": { "identifier": 1 }, "previous_version": { "identifier": 0 }, "namespace" : { "identifier" : 0 }, "event": { "type": "update", "date_created":"2023-10-11T13:45:33.749328+01:00"} }

{ "type": "articles", "identifier": "/enwiki/Pascal's_wager" }
{ "name": "Pascal's_wager", "is_part_of": { "identifier":"enwiki" }, "in_language": { "identifier": "en" }, "version": { "identifier": 1 }, "previous_version": { "identifier": 0 }, "namespace" : { "identifier" : 0 }, "event": { "type": "update", "date_created":"2023-10-11T13:45:33.749328+01:00"} }

{ "type": "articles", "identifier": "/enwiki/Magnoliopsida" }
{ "name": "Magnoliopsida", "is_part_of": { "identifier":"enwiki" }, "in_language": { "identifier": "en" }, "version": { "identifier": 1 }, "previous_version": { "identifier": 0 }, "namespace" : { "identifier" : 0 }, "event": { "type": "update", "date_created":"2023-10-11T13:45:33.749328+01:00"} }

{ "type": "articles", "identifier": "/eswiki/Dicotyledoneae" }
{ "name": "Dicotyledoneae", "is_part_of": { "identifier":"eswiki" }, "in_language": { "identifier": "es" }, "version": { "identifier": 1 }, "previous_version": { "identifier": 0 }, "namespace" : { "identifier" : 0 }, "event": { "type": "update", "date_created":"2023-10-11T13:45:33.749328+01:00"} }

{ "type": "articles", "identifier": "/enwiki/Jacuzzi_Boys" }
{ "name": "Jacuzzi_Boys", "is_part_of": { "identifier":"enwiki" }, "in_language": { "identifier": "en" }, "version": { "identifier": 1 }, "previous_version": { "identifier": 0 }, "namespace" : { "identifier" : 0 }, "event": { "type": "update", "date_created":"2023-10-11T13:45:33.749328+01:00"} }

{ "type": "articles", "identifier": "/eswiki/Cannabis_(psicotrópico)" }
{ "name": "Cannabis_(psicotrópico)", "is_part_of": { "identifier":"eswiki" }, "in_language": { "identifier": "es" }, "version": { "identifier": 1 }, "previous_version": { "identifier": 0 }, "namespace" : { "identifier" : 0 }, "event": { "type": "update", "date_created":"2023-10-11T13:45:33.749328+01:00"} }

{ "type": "articles", "identifier": "/enwiki/Las_Rosas,_Santa_Fe" }
{ "name": "Las_Rosas,_Santa_Fe", "is_part_of": { "identifier":"enwiki" }, "in_language": { "identifier": "en" }, "version": { "identifier": 1 }, "previous_version": { "identifier": 0 }, "namespace" : { "identifier" : 0 }, "event": { "type": "update", "date_created":"2023-10-11T13:45:33.749328+01:00"} }

{ "type": "articles", "identifier": "/enwiki/Flag_of_Singapore" }
{ "name": "Flag_of_Singapore", "is_part_of": { "identifier":"enwiki" }, "in_language": { "identifier": "en" }, "version": { "identifier": 1 }, "previous_version": { "identifier": 0 }, "namespace" : { "identifier" : 0 }, "event": { "type": "update", "date_created":"2023-10-11T13:45:33.749328+01:00"} }

{ "type": "articles", "identifier": "/eswiki/Muerte_de_Ayrton_Senna" }
{ "name": "Muerte_de_Ayrton_Senna", "is_part_of": { "identifier":"eswiki" }, "in_language": { "identifier": "es" }, "version": { "identifier": 1 }, "previous_version": { "identifier": 0 }, "namespace" : { "identifier" : 0 }, "event": { "type": "update", "date_created":"2023-10-11T13:45:33.749328+01:00"} }

{ "type": "articles", "identifier": "/eswiki/Anexo:Anexo:Muertes_en_Fórmula_1" }
{ "name": "Anexo:Muertes_en_Fórmula_1", "is_part_of": { "identifier":"eswiki" }, "in_language": { "identifier": "es" }, "version": { "identifier": 1 }, "previous_version": { "identifier": 0 }, "namespace" : { "identifier" : 0 }, "event": { "type": "update", "date_created":"2023-10-11T13:45:33.749328+01:00"} }

{ "type": "articles", "identifier": "/eswiki/Kim_Kardashian" }
{ "name": "Kim_Kardashian", "is_part_of": { "identifier":"eswiki" }, "in_language": { "identifier": "es" }, "version": { "identifier": 1 }, "previous_version": { "identifier": 0 }, "namespace" : { "identifier" : 0 }, "event": { "type": "update", "date_created":"2023-10-11T13:45:33.749328+01:00"} }

{ "type": "articles", "identifier": "/eswiki/Donald_Trump" }
{ "name": "Donald_Trump", "is_part_of": { "identifier":"eswiki" }, "in_language": { "identifier": "es" }, "version": { "identifier": 1 }, "previous_version": { "identifier": 0 }, "namespace" : { "identifier" : 0 }, "event": { "type": "update", "date_created":"2023-10-11T13:45:33.749328+01:00"} }

{ "type": "articles", "identifier": "/enwiki/Public_hearings_of_the_United_States_House_Select_Committee_on_the_January_6_Attack" }
{ "name": "Public_hearings_of_the_United_States_House_Select_Committee_on_the_January_6_Attack", "is_part_of": { "identifier":"enwiki" }, "in_language": { "identifier": "en" }, "version": { "identifier": 1 }, "previous_version": { "identifier": 0}, "namespace" : { "identifier" : 0 }, "event": { "type": "update", "date_created":"2023-10-11T13:45:33.749328+01:00"} }

{ "type": "articles", "identifier": "/eswiki/Guns_N'_Roses" }
{ "name": "Guns_N'_Roses", "is_part_of": { "identifier":"eswiki" }, "in_language": { "identifier": "es" }, "version": { "identifier": 1 }, "previous_version": { "identifier": 0 }, "namespace" : { "identifier" : 0 }, "event": { "type": "update", "date_created":"2023-10-11T13:45:33.749328+01:00"} }
