identifier,articles,files,templates,categories
akwiktionary,1,1,1,1
biwiktionary,1,1,1,1
nawikiquote,1,1,1,1
crwiktionary,1,1,1,1
crwikiquote,1,1,1,1
aawikibooks,1,1,1,1
miwikibooks,1,1,1,1
lnwikibooks,1,1,1,1
akwikibooks,1,1,1,1
yowiktionary,1,1,1,1
bowiktionary,1,1,1,1
lrcwiki,1,1,1,1
gnwikibooks,1,1,1,1
krwiki,1,1,1,1
krwikiquote,1,1,1,1
dzwiktionary,1,1,1,1
hzwiki,1,1,1,1
kswikibooks,1,1,1,1
kswikiquote,1,1,1,1
gawikibooks,1,1,1,1
aawiki,1,1,1,1
aawiktionary,1,1,1,1
guwikibooks,1,1,1,1
aswikibooks,1,1,1,1
kwwikiquote,1,1,1,1
bowikibooks,1,1,1,1
vowikiquote,1,1,1,1
biwikibooks,1,1,1,1
rmwiktionary,1,1,1,1
rmwikibooks,1,1,1,1
aywikibooks,1,1,1,1
twwiktionary,1,1,1,1
sewikibooks,1,1,1,1
bmwikiquote,1,1,1,1
rnwiktionary,1,1,1,1
mhwiktionary,1,1,1,1
tkwikiquote,1,1,1,1
ndswikiquote,1,1,1,1
chwikibooks,1,1,1,1
snwiktionary,1,1,1,1
bhwiktionary,1,1,1,1
mywikibooks,1,1,1,1
muswiki,1,1,1,1
ugwikibooks,1,1,1,1
ugwikiquote,1,1,1,1
towiktionary,1,1,1,1
abwiktionary,1,1,1,1
zawikiquote,1,1,1,1
xhwiktionary,1,1,1,1
piwiktionary,1,1,1,1
knwikibooks,1,1,1,1
quwikiquote,1,1,1,1
scwiktionary,1,1,1,1
lbwikibooks,1,1,1,1
chwiktionary,1,1,1,1
zuwikibooks,1,1,1,1
yowikibooks,1,1,1,1
ttwikiquote,1,1,1,1
howiki,1,1,1,1
xhwikibooks,1,1,1,1
bmwiktionary,1,1,1,1
nawikibooks,1,1,1,1
wawikibooks,1,1,1,1
avwiktionary,1,1,1,1
pswikibooks,1,1,1,1
gawikiquote,1,1,1,1
mnwikibooks,1,1,1,1
gotwikibooks,1,1,1,1
cowikiquote,1,1,1,1
tkwikibooks,1,1,1,1
ndswikibooks,1,1,1,1
angwikisource,1,1,1,1
bmwikibooks,1,1,1,1
amwikiquote,1,1,1,1
kjwiki,1,1,1,1
nahwikibooks,1,1,1,1
quwikibooks,1,1,1,1
vowikibooks,1,1,1,1
zawikibooks,1,1,1,1
suwikibooks,1,1,1,1
mhwiki,1,1,1,1
cowikibooks,1,1,1,1
swwikibooks,1,1,1,1
uzwikibooks,1,1,1,1
kkwikiquote,1,1,1,1
iiwiki,1,1,1,1
lbwikiquote,1,1,1,1
astwikibooks,1,1,1,1
aswiktionary,1,1,1,1
chowiki,1,1,1,1
wowikiquote,1,1,1,1
htwikisource,1,1,1,1
ngwiki,1,1,1,1
angwikiquote,1,1,1,1
astwikiquote,1,1,1,1
kywikiquote,1,1,1,1
zh_min_nanwikibooks,1,1,1,1
mgwikibooks,1,1,1,1
cywikibooks,1,1,1,1
bswikibooks,1,1,1,1
kywikibooks,1,1,1,1
kuwikibooks,1,1,1,1
zh_min_nanwikiquote,1,1,1,1
iewikibooks,1,1,1,1
fowikisource,1,1,1,1
fywikibooks,1,1,1,1
lvwikibooks,1,1,1,1
mrwikiquote,1,1,1,1
tgwikibooks,1,1,1,1
ocwikibooks,1,1,1,1
pawikibooks,1,1,1,1
hiwikivoyage,1,1,1,1
ikwiktionary,1,1,1,1
bewikibooks,1,1,1,1
afwikibooks,1,1,1,1
shnwikivoyage,1,1,2,1
zawiktionary,1,1,1,1
thwikinews,1,1,1,1
brwikiquote,1,1,1,1
cvwikibooks,1,1,1,1
angwikibooks,1,1,1,1
newikibooks,1,1,1,1
tnwiktionary,1,1,1,1
iawikibooks,1,1,1,1
hywikibooks,1,1,1,1
afwikiquote,1,1,1,1
tewikibooks,1,1,1,1
iswikiquote,1,1,1,1
mrwikibooks,1,1,1,1
kmwikibooks,1,1,1,1
jawikiversity,1,1,1,1
uzwikiquote,1,1,1,1
iuwiktionary,1,1,1,1
klwiki,1,1,1,1
crwiki,1,1,1,1
slwikibooks,1,1,1,1
pwnwiki,1,1,1,1
sqwikiquote,1,1,1,1
bswikinews,1,1,1,2
mlwikibooks,1,1,1,1
napwikisource,1,1,1,1
tswiktionary,1,1,1,1
skwikisource,1,1,1,1
kuwikiquote,1,1,1,1
rwwiktionary,1,1,1,1
liwikibooks,1,1,1,1
mswikibooks,1,1,1,1
kkwikibooks,1,1,1,1
chrwiktionary,1,1,1,1
trwikivoyage,1,1,1,1
bnwikiquote,1,1,1,2
cywikiquote,1,1,1,1
pswikivoyage,1,1,1,1
dawikiquote,1,1,1,1
knwikiquote,1,1,1,1
dvwiktionary,1,1,1,1
hiwikiversity,1,1,1,1
kwwiktionary,1,1,1,1
urwikibooks,1,1,1,1
euwikiquote,1,1,1,1
srwikibooks,1,1,1,1
gvwiktionary,1,1,1,1
quwiktionary,1,1,1,1
guwikiquote,1,1,1,1
simplewikibooks,1,1,1,1
tiwiktionary,1,1,1,1
pntwiki,1,1,1,1
ttwikibooks,1,1,1,1
nawiktionary,1,1,1,1
tlwikibooks,1,1,1,1
dinwiki,1,1,1,1
sswiktionary,1,1,1,1
chwiki,1,1,1,1
etwikibooks,1,1,1,1
sgwiki,1,1,1,1
lawikibooks,1,1,1,1
tiwiki,1,1,1,1
bgwikibooks,1,1,1,1
viwikiquote,1,1,1,1
kawikibooks,1,2,1,1
rowikiquote,1,1,1,1
bgwikinews,1,1,1,2
bewikiquote,1,1,1,1
lnwiktionary,1,1,1,1
glwikiquote,1,1,1,1
kowikiversity,1,1,1,1
pcmwiki,1,1,1,1
tewikiquote,1,1,1,1
urwikiquote,1,1,1,1
sswiki,1,1,1,1
huwikinews,1,1,1,2
sqwikinews,1,1,1,1
skwikibooks,1,1,1,1
akwiki,1,1,1,1
nowikinews,1,1,1,2
mlwikiquote,1,1,1,1
adywiki,1,1,2,1
kowikinews,1,1,1,2
banwikisource,1,1,1,1
elwikibooks,1,2,1,1
tswiki,1,1,1,1
vewiki,1,1,1,1
sdwikinews,1,1,1,1
rnwiki,1,1,1,1
kawikiquote,1,1,1,1
chywiki,1,1,1,1
eewiki,1,1,1,1
ltwikibooks,1,1,1,1
hiwikiquote,1,1,1,1
rmywiki,1,1,1,1
mkwikibooks,1,1,1,1
sahwikisource,1,1,1,1
svwikiversity,1,1,1,1
eowikibooks,2,1,1,1
elwikiversity,2,1,1,1
rowikivoyage,2,1,1,1
jawikivoyage,2,1,1,1
nowikiquote,2,1,1,1
dzwiki,2,1,1,1
arwikiversity,2,1,2,1
stwiki,2,1,1,1
kcgwiki,2,1,1,1
ukwikivoyage,2,1,1,1
amwiktionary,2,1,1,1
bnwikivoyage,2,1,1,1
euwikisource,2,1,1,1
yiwiktionary,2,1,1,1
rowikibooks,2,1,1,1
glwikisource,2,1,1,1
aywiktionary,2,1,1,1
sawikibooks,2,1,1,1
ikwiki,2,1,1,1
orwikisource,2,1,1,1
lawikiquote,2,1,1,1
bnwikibooks,2,1,2,1
madwiki,2,1,1,1
pawikisource,2,1,1,1
eowikinews,2,1,1,2
arwikibooks,2,1,1,1
nywiki,2,1,2,1
zuwiktionary,2,1,1,1
altwiki,2,1,2,1
pihwiki,2,1,1,1
ffwiki,2,1,1,1
ltgwiki,2,1,1,1
guwwiki,2,1,1,1
tpiwiktionary,2,1,1,1
gotwiki,2,1,1,1
hifwiktionary,2,1,1,1
hewikinews,2,1,1,2
jbowiktionary,2,1,1,1
tnwiki,2,1,2,1
hrwikibooks,2,1,1,1
roa_rupwiktionary,2,1,1,1
eowikivoyage,2,1,1,1
sahwikiquote,2,1,1,1
srnwiki,2,1,1,1
trwikinews,2,1,1,2
tawikiquote,2,1,1,2
guwwiktionary,2,1,1,1
glwikibooks,2,1,1,1
ukwikibooks,2,1,1,1
nlwikiquote,2,1,1,1
bmwiki,2,1,1,1
jawikiquote,2,1,1,1
tywiki,2,1,1,1
iuwiki,2,1,1,1
tawikibooks,2,1,1,1
kgwiki,2,1,1,1
smwiki,2,1,1,1
iswikibooks,2,1,1,1
stwiktionary,2,1,1,1
amiwiki,2,1,1,1
simplewikiquote,2,1,1,1
wawikisource,2,1,1,1
fjwiki,2,1,1,1
nqowiki,2,1,1,1
omwiki,2,1,1,1
bclwikiquote,2,1,1,1
jvwikisource,2,1,1,1
liwikiquote,2,1,1,1
slwikiversity,2,1,1,1
tpiwiki,2,1,2,1
fiwikinews,2,1,1,2
kowikiquote,2,1,1,1
elwikivoyage,2,1,1,1
csbwiktionary,2,1,1,1
thwikibooks,2,1,2,1
kiwiki,2,1,1,1
miwiktionary,2,1,1,1
xhwiki,2,1,1,1
siwiktionary,2,1,1,1
trwikibooks,2,1,1,1
biwiki,2,1,1,1
huwikiquote,2,1,1,1
tetwiki,2,1,1,1
novwiki,2,1,1,1
roa_rupwiki,2,1,1,1
klwiktionary,2,1,1,1
ugwiktionary,2,1,1,1
chrwiki,2,1,1,1
dawikibooks,2,1,1,1
nowikibooks,2,1,1,1
siwikibooks,2,1,1,1
nnwikiquote,2,1,1,1
lbewiki,2,1,4,1
kbdwiki,2,1,2,2
svwikiquote,2,1,1,1
trvwiki,2,1,1,1
suwikiquote,2,1,1,1
fiwikiversity,2,1,1,1
shiwiki,2,1,2,1
niawiki,2,1,1,1
gnwiktionary,2,1,1,1
atjwiki,2,1,1,1
nawiki,2,1,1,1
svwikivoyage,2,1,1,1
fowiktionary,2,1,1,1
ltwikisource,2,1,1,1
bswikisource,2,1,1,1
mtwiktionary,2,1,1,1
bjnwiktionary,2,1,1,1
wowiki,2,1,1,1
ukwikinews,2,1,2,2
jamwiki,2,1,1,1
tcywiki,2,1,2,1
thwikiquote,2,1,1,1
iewiktionary,2,1,1,1
liwikisource,2,1,1,1
fiwikivoyage,2,1,1,1
gcrwiki,2,1,1,1
hrwikiquote,2,1,1,1
cuwiki,2,1,1,1
viwikivoyage,2,1,1,1
zh_min_nanwikisource,2,1,1,1
kowikibooks,2,1,1,1
aswikisource,2,1,1,2
elwikiquote,2,1,1,1
angwiktionary,2,1,1,1
svwikibooks,2,1,1,1
bgwikisource,2,1,1,1
liwikinews,2,1,1,1
mniwiktionary,2,1,1,1
taywiki,2,1,1,1
idwikiquote,2,1,1,1
lijwikisource,2,1,1,1
rowikinews,2,1,1,2
hiwikibooks,2,1,1,1
blkwiki,2,1,2,1
bawikibooks,2,1,1,1
fawikinews,2,1,2,2
gomwiktionary,2,1,1,1
twwiki,2,1,1,1
jbowiki,2,1,1,1
kbpwiki,2,1,1,1
pdcwiki,2,1,1,1
xalwiki,2,1,2,1
gdwiktionary,2,1,2,2
hawwiki,2,1,1,1
srwikiquote,2,1,1,1
gawiktionary,2,1,2,1
igwikiquote,2,1,1,1
etwikisource,2,1,1,1
zawiki,2,1,1,1
cswikibooks,2,1,1,1
mrwikisource,2,1,2,1
kswiki,2,1,2,1
tlwikiquote,2,1,1,1
towiki,2,1,1,1
gagwiki,2,1,2,1
dawikisource,2,1,1,1
zhwikiversity,2,1,2,1
piwiki,2,1,1,1
yiwikisource,2,2,1,1
guwiktionary,2,1,2,1
mkwikisource,2,1,1,1
lgwiki,2,1,1,1
elwikinews,2,1,1,2
suwiktionary,2,1,1,1
mnwwiki,2,1,2,1
wowiktionary,2,1,1,1
mdfwiki,2,1,2,2
mrwiktionary,2,1,1,1
papwiki,2,1,1,1
euwikibooks,2,1,1,1
azwikibooks,2,1,1,2
svwikinews,2,1,1,2
cawikibooks,2,1,2,1
arcwiki,2,1,1,1
sawikiquote,2,1,1,1
fiwikiquote,2,1,1,1
awawiki,2,1,2,1
shywiktionary,2,1,1,1
igwiktionary,2,1,1,1
eswikivoyage,2,1,2,2
kaawiki,2,1,2,1
sowiktionary,2,1,1,1
slwikiquote,2,1,1,2
dtywiki,2,1,2,1
vecwikisource,2,1,1,1
krcwiki,2,1,2,2
cywikisource,2,1,1,2
pflwiki,2,1,1,1
dsbwiki,2,1,2,2
hawiktionary,2,1,1,1
ltwikiquote,2,1,1,2
tawikinews,2,1,1,2
fawikibooks,2,1,1,1
kshwiki,2,1,2,1
sdwiktionary,2,1,1,1
kswiktionary,2,1,1,1
bxrwiki,2,1,2,2
jawikinews,2,1,1,2
hsbwiktionary,2,1,1,1
tyvwiki,2,1,2,1
anwiktionary,2,1,1,1
idwikisource,2,1,2,1
arwikiquote,2,1,2,2
hiwikisource,2,1,2,1
pmswikisource,2,1,1,1
lnwiki,2,1,1,2
hywikiquote,2,1,2,2
eswikiversity,2,1,1,1
ptwikivoyage,2,1,1,2
iawiktionary,2,1,1,1
gomwiki,2,1,2,1
mwlwiki,2,1,2,2
rmwiki,2,1,1,2
hewikivoyage,2,1,2,2
azwikiquote,2,1,1,2
tkwiktionary,2,1,1,1
avwiki,2,1,2,1
cbk_zamwiki,2,1,2,1
diqwiktionary,2,1,1,2
szywiki,2,1,1,1
extwiki,2,1,1,1
bswikiquote,2,1,1,1
furwiki,2,1,1,1
inhwiki,2,1,2,2
zhwikiquote,2,1,2,2
vecwiktionary,2,1,1,1
iswikisource,2,1,1,1
mkwiktionary,2,1,1,1
cawikinews,2,1,2,2
bewiktionary,2,1,2,2
dvwiki,2,1,2,1
skwikiquote,2,1,1,1
lfnwiki,2,1,1,1
eowikisource,2,1,1,2
koiwiki,2,1,2,2
olowiki,2,1,2,2
cawikiquote,2,1,2,1
ladwiki,2,1,2,2
nlwikinews,2,1,1,2
bclwiktionary,2,1,1,1
smnwiki,2,1,2,2
skrwiki,2,1,1,1
sqwikibooks,2,1,1,1
rwwiki,2,1,2,2
lezwiki,2,1,2,2
aywiki,2,1,1,1
nlwikivoyage,2,1,1,1
itwikiversity,2,1,2,2
nowikisource,2,1,1,2
thwikisource,2,1,2,2
csbwiki,2,1,1,1
ruwikiversity,2,1,2,2
niawiktionary,2,1,1,1
cswikiversity,2,1,1,2
lowiki,2,1,2,2
stqwiki,2,1,2,1
eowikiquote,2,1,1,2
idwikibooks,2,1,1,1
pagwiki,2,1,1,1
cawikisource,2,1,1,1
mtwiki,2,1,2,2
dagwiki,2,1,1,1
nrmwiki,2,1,1,1
ruwikivoyage,2,4,1,1
pcdwiki,2,1,2,1
kkwiktionary,2,1,1,1
trwikiquote,2,1,2,2
angwiki,2,1,2,2
zeawiki,2,1,1,2
gnwiki,2,1,1,2
nahwiktionary,2,1,2,1
abwiki,2,1,2,2
bgwikiquote,2,1,1,1
smwiktionary,2,1,1,1
kwwiki,2,1,2,2
hewikibooks,2,2,2,2
zhwikibooks,2,1,2,1
yuewiktionary,2,1,1,2
kvwiki,2,1,2,2
cswikinews,2,1,1,2
bswiktionary,2,1,1,2
guwikisource,2,1,1,1
brwikisource,2,1,1,1
ttwiktionary,2,1,1,1
fiu_vrowiki,2,1,1,2
zhwikivoyage,2,1,2,2
gvwiki,2,1,2,4
ptwikiversity,2,1,1,1
frwikiquote,2,1,2,2
kabwiki,2,1,2,2
fiwikibooks,2,1,1,1
mlwikisource,2,1,2,2
tumwiki,2,1,2,1
tkwiki,2,1,2,2
satwiki,2,1,2,1
hywikisource,2,1,1,2
dewikiquote,2,1,1,2
nsowiki,2,1,1,1
frpwiki,2,1,2,2
miwiki,2,1,2,1
glkwiki,2,1,1,1
udmwiki,2,1,2,2
fawikivoyage,2,1,2,2
hewikiquote,2,1,2,2
ganwiki,2,1,1,2
scwiki,2,1,2,2
myvwiki,2,1,4,2
cowiktionary,2,1,1,1
sewiki,2,1,2,2
pnbwiktionary,2,1,1,1
cowiki,2,1,2,2
lbwiktionary,2,1,2,2
arwikinews,2,1,2,4
hrwikisource,4,1,1,1
ndswiktionary,4,1,2,4
azwikisource,4,1,2,2
ruwikibooks,4,2,2,2
frwikivoyage,4,1,2,2
nlwikibooks,4,1,2,1
roa_tarawiki,4,1,2,2
bjnwiki,4,1,2,1
ugwiki,4,1,1,2
ruewiki,4,1,2,2
minwiktionary,4,1,1,1
bewikisource,4,1,1,2
trwikisource,4,1,2,2
hifwiki,4,1,2,2
vepwiki,4,1,2,2
nahwiki,4,1,2,2
lvwiktionary,4,1,2,1
mniwiki,4,1,2,1
pamwiki,4,1,2,2
kawiktionary,4,1,2,1
iewiki,4,1,1,1
zuwiki,4,1,2,2
nnwiktionary,4,1,1,1
vlswiki,4,1,1,2
mrjwiki,4,1,2,2
cswikiquote,4,1,1,1
nlwikisource,4,1,1,1
lijwiki,4,1,2,2
hywwiki,4,1,2,2
itwikivoyage,4,1,2,2
plwikivoyage,4,1,1,1
etwikiquote,4,1,1,2
plwikibooks,4,1,2,2
ptwikiquote,4,1,2,2
nds_nlwiki,4,1,1,2
itwikinews,4,1,2,2
hakwiki,4,1,2,2
bowiki,4,1,1,1
fywiktionary,4,1,2,2
fiwikisource,4,1,1,2
sowiki,4,1,2,2
dewikinews,4,1,2,4
eswikiquote,4,1,2,2
acewiki,4,1,2,1
bhwiki,4,1,4,4
gorwiki,4,1,2,2
swwiktionary,4,1,2,1
bnwikisource,4,2,2,2
map_bmswiki,4,1,2,2
newiktionary,4,1,1,1
viwikisource,4,1,2,2
shnwiki,4,1,2,2
kmwiki,4,2,2,2
fawikiquote,4,1,1,2
ptwikibooks,4,2,2,2
mhrwiki,4,1,2,2
pawiktionary,4,1,1,1
lawikisource,4,1,1,2
jawikisource,4,1,2,2
maiwiki,4,1,2,2
eswikinews,4,1,2,2
emlwiki,4,2,1,2
bugwiki,4,1,1,1
napwiki,4,1,2,2
tawikisource,4,1,2,1
snwiki,4,1,1,1
rowikisource,4,1,1,2
igwiki,4,1,1,1
itwikibooks,4,1,2,2
tewikisource,4,1,2,1
mswiktionary,4,1,2,2
elwikisource,4,1,1,1
zhwikinews,4,1,2,2
jawikibooks,4,1,1,2
svwikisource,4,1,1,2
cdowiki,4,1,2,2
eswikibooks,4,1,2,2
zh_classicalwiki,4,1,2,2
banwiki,4,1,2,2
fowiki,4,1,2,2
bclwiki,4,1,2,2
frwikiversity,4,1,2,2
mznwiki,4,1,2,2
hsbwiki,4,1,2,2
sahwiki,4,2,4,2
slwikisource,4,1,1,2
wawiki,4,1,1,2
knwikisource,4,1,2,1
huwikisource,4,1,1,2
scnwiktionary,4,1,1,1
lmowiktionary,4,1,1,1
amwiki,4,2,2,2
zh_min_nanwiktionary,4,1,1,1
arywiki,4,1,2,2
afwiktionary,4,1,2,1
sdwiki,4,1,2,2
sawiki,4,1,2,2
nvwiki,4,2,2,2
hawiki,4,1,2,2
xmfwiki,4,1,2,2
omwiktionary,4,1,1,1
vowiktionary,4,1,1,1
bat_smgwiki,4,1,2,2
tlwiktionary,4,1,1,1
pswiki,4,2,2,2
ukwikiquote,4,1,2,2
gdwiki,4,1,2,2
cywiktionary,4,1,1,1
crhwiki,4,1,4,2
frwikinews,4,1,2,4
bpywiki,4,1,2,2
avkwiki,4,1,2,2
ilowiki,4,1,4,4
pswiktionary,4,1,1,1
ruwikiquote,4,1,1,2
frwikibooks,4,1,2,2
yiwiki,4,2,2,2
frrwiki,4,2,2,2
hewiktionary,4,1,2,2
aswiki,4,2,4,2
slwiktionary,4,1,2,2
ptwikinews,4,1,2,4
fawikisource,4,1,2,2
mnwiki,4,2,2,4
dewikivoyage,4,1,2,2
sawikisource,4,1,1,1
tgwiktionary,4,1,2,2
urwiktionary,4,1,1,1
skwiktionary,4,1,1,1
fjwiktionary,4,1,1,1
iawiki,4,1,2,2
plwikinews,4,2,2,2
oswiki,4,1,4,2
shnwiktionary,4,1,1,1
hrwiktionary,4,1,2,2
orwiki,4,1,4,2
wawiktionary,4,1,2,2
plwikiquote,4,1,1,2
mnwwiktionary,4,1,2,2
guwiki,4,1,2,2
siwiki,4,2,4,2
kowikisource,4,1,2,2
alswiki,4,1,2,2
simplewiktionary,4,1,1,1
dewikibooks,4,2,1,1
lawiktionary,4,1,2,2
ptwikisource,4,1,2,2
knwiki,4,2,4,2
newiki,4,2,4,2
srwikisource,4,1,1,2
iowiki,4,1,2,2
dawiktionary,4,1,2,2
viwikibooks,4,2,2,2
scnwiki,4,2,2,2
yowiki,4,1,2,2
sqwiktionary,4,1,2,2
enwikinews,4,2,2,4
quwiki,4,1,2,2
kmwiktionary,4,1,2,1
sgwiktionary,4,1,2,2
barwiki,4,2,2,2
diqwiki,4,1,2,2
mnwiktionary,4,1,1,1
iswiktionary,4,1,2,2
dewikiversity,4,2,2,4
bnwiktionary,4,1,2,2
astwiktionary,4,1,2,2
wuuwiki,4,1,2,2
brwiktionary,4,1,2,2
pawiki,4,2,4,2
liwiki,4,1,1,2
cswikisource,4,1,1,2
euwiktionary,4,1,2,2
scowiki,4,1,4,4
srwikinews,4,1,2,4
azwiktionary,4,1,2,2
cvwiki,4,1,4,4
huwikibooks,4,4,2,2
szlwiki,4,1,2,2
ukwiktionary,4,1,2,2
enwikiversity,4,4,2,2
lowiktionary,4,1,1,1
enwikivoyage,4,2,2,2
ocwiktionary,4,1,2,2
pmswiki,4,2,2,2
suwiki,4,1,2,2
jvwiktionary,4,1,1,1
gawiki,4,2,2,4
lldwiki,4,1,2,1
kywiktionary,4,1,2,1
arwiktionary,4,1,2,2
anwiki,4,2,2,4
htwiki,4,1,1,2
enwikiquote,4,1,2,4
lbwiki,4,2,2,4
lmowiki,4,2,4,2
itwikiquote,4,1,2,2
glwiktionary,4,1,2,2
pnbwiki,4,1,2,4
kuwiki,4,1,2,4
vecwiki,4,1,4,2
bawiki,4,2,4,4
fywiki,4,2,2,4
iswiki,4,2,2,4
ckbwiki,4,2,4,4
kywiki,4,2,2,2
jvwiki,4,2,4,4
brwiki,4,2,2,4
newwiki,6,1,4,4
swwiki,6,2,2,4
ndswiki,6,1,2,2
itwikisource,6,1,2,4
enwikibooks,6,2,4,2
eswikisource,6,1,2,2
ocwiki,6,1,2,4
orwiktionary,6,1,1,1
tewiki,6,4,4,4
ukwikisource,6,1,2,2
tewiktionary,6,2,2,1
skrwiktionary,6,1,1,1
arwikisource,6,2,2,4
eowiktionary,6,1,2,4
mywiki,6,2,4,4
liwiktionary,6,1,2,2
be_x_oldwiki,6,2,4,4
mywiktionary,6,1,1,1
sqwiki,6,2,4,4
mlwiktionary,6,1,2,1
afwiki,6,2,4,4
tgwiki,6,1,4,4
vowiki,6,1,1,2
cswiktionary,6,1,2,4
mgwiki,6,1,2,2
fawiktionary,6,1,2,2
uzwiktionary,6,1,2,2
astwiki,6,1,2,4
mrwiki,6,4,4,4
etwiktionary,6,1,2,2
nowiktionary,6,1,2,2
tlwiki,6,2,4,4
rowiktionary,6,1,2,4
mlwiki,6,2,4,4
mkwiki,6,2,4,4
tawiki,6,2,4,4
hiwiktionary,6,1,2,1
lawiki,6,1,2,4
zh_yuewiki,6,2,4,4
idwiktionary,6,1,2,4
bswiki,6,2,4,4
kawiki,6,4,4,4
thwiktionary,6,1,2,4
hiwiki,6,2,4,4
srwiktionary,6,1,2,4
minwiki,6,1,2,2
dewikisource,6,2,2,2
viwiktionary,6,1,2,2
plwikisource,6,1,2,4
nnwiki,6,1,4,4
azwiki,6,4,4,4
slwiki,6,2,4,4
sawiktionary,6,1,1,1
hrwiki,6,4,4,4
lvwiki,6,4,4,4
knwiktionary,6,1,2,1
azbwiki,6,1,4,6
ptwiktionary,6,1,2,4
kkwiki,6,4,4,4
glwiki,6,1,4,4
hewikisource,6,1,2,4
ltwiki,6,4,4,4
hywiktionary,6,1,2,2
simplewiki,6,1,4,4
elwiki,6,4,4,4
skwiki,6,1,4,4
jawiktionary,6,1,2,4
iowiktionary,6,1,1,4
cywiki,6,4,4,4
thwiki,6,4,4,4
bnwiki,6,4,4,6
trwiktionary,6,1,2,4
zhwikisource,6,1,2,4
urwiki,6,4,4,6
etwiki,6,1,2,4
tawiktionary,6,1,2,2
kowiktionary,6,1,1,2
frwikisource,6,2,2,2
bgwiki,6,1,4,4
mswiki,6,4,4,4
fiwiktionary,6,1,2,4
huwiktionary,6,1,4,2
dawiki,6,1,4,4
bewiki,6,2,4,6
cewiki,6,1,4,4
euwiki,6,1,4,4
uzwiki,6,2,4,4
eowiki,6,4,4,6
ttwiki,6,2,4,4
hewiki,6,4,4,6
itwiktionary,6,1,2,2
cawiktionary,6,1,2,4
ltwiktionary,6,1,4,4
hywiki,6,4,4,4
zh_min_nanwiki,6,1,4,4
ruwikisource,6,4,2,4
kuwiktionary,6,1,2,4
enwikisource,6,4,2,4
huwiki,6,2,4,4
plwiktionary,6,1,2,2
bgwiktionary,6,1,4,1
elwiktionary,6,1,2,4
trwiki,6,4,6,6
nlwiktionary,6,1,6,4
cswiki,6,1,4,6
fiwiki,6,4,4,4
svwiktionary,6,1,1,4
shwiktionary,6,1,1,1
eswiktionary,6,1,2,4
nowiki,6,1,4,6
rowiki,6,6,4,6
dewiktionary,8,1,2,2
cawiki,8,4,4,6
idwiki,8,4,4,6
kowiki,8,4,4,6
viwiki,8,4,6,6
zhwiktionary,8,1,4,6
arzwiki,8,2,4,6
mgwiktionary,8,1,4,2
ptwiki,8,4,4,6
plwiki,8,2,4,6
warwiki,8,2,4,6
ukwiki,8,6,6,6
jawiki,8,4,4,6
ruwiktionary,8,1,4,6
arwiki,8,4,6,6
zhwiki,8,4,8,6
itwiki,8,6,6,6
fawiki,8,4,6,6
nlwiki,8,1,4,6
srwiki,8,4,6,4
eswiki,8,1,4,6
ruwikinews,8,1,4,8
shwiki,8,4,4,4
frwiki,8,4,6,6
svwiki,8,1,4,6
dewiki,8,6,4,6
ruwiki,8,6,6,6
frwiktionary,8,1,4,6
enwiktionary,8,1,4,6
cebwiki,10,1,2,6
enwiki,10,6,6,8
