<?xml version="1.0" encoding="utf-8"?>
<!-- Generator: Adobe Illustrator 21.1.0, SVG Export Plug-In . SVG Version: 6.00 Build 0)  -->
<svg version="1.1" id="Livello_1" xmlns="http://www.w3.org/2000/svg" xmlns:xlink="http://www.w3.org/1999/xlink" x="0px" y="0px"
	 viewBox="0 0 128 160" style="enable-background:new 0 0 128 160;" xml:space="preserve">
<style type="text/css">
	.st0{fill:#8F0000;}
	.st1{stroke:#000000;stroke-miterlimit:10;}
</style>
<g>
	<path d="M7.9-109.4h7.7v11.6c0,1.1,0.9,1.9,1.9,1.9h92.8c1.1,0,1.9-0.9,1.9-1.9v-77.4c0-1.1-0.9-1.9-1.9-1.9H98.7v-9.7
		c0-1.1-0.9-1.9-1.9-1.9H7.9c-1.1,0-1.9,0.9-1.9,1.9v75.4C6-110.3,6.8-109.4,7.9-109.4z M98.8-111.4v-61.8h9.7v73.5H19.6v-9.7h77.3
		C97.9-109.4,98.8-110.3,98.8-111.4z M9.8-184.8h85.1v71.5H9.8V-184.8z"/>
	<path class="st0" d="M58.7-166.9l-18,18l-5.4-5.4c-0.8-0.8-2-0.8-2.7,0L12.3-134l2.7,2.7l18.9-18.9l18.9,18.9l2.7-2.7l-12.2-12.2
		l16.6-16.6l29.6,29.6l2.7-2.7l-30.9-30.9C60.7-167.6,59.5-167.6,58.7-166.9z"/>
	<path class="st0" d="M25.3-159.7c5.3,0,9.7-4.3,9.7-9.7c0-5.4-4.4-9.6-9.7-9.6s-9.7,4.3-9.7,9.7C15.6-163.9,20-159.7,25.3-159.7z
		 M25.3-175.2c3.2,0,5.8,2.6,5.8,5.8c0,3.2-2.6,5.8-5.8,5.8s-5.8-2.6-5.8-5.8C19.5-172.6,22.1-175.2,25.3-175.2z"/>
	<path class="st0" d="M81.4-121c-1.7,0-2.5-0.6-3.6-1.5c-1.3-1-2.9-2.4-6-2.4s-4.7,1.3-6,2.4c-1.1,0.9-1.9,1.5-3.6,1.5
		c-1.7,0-2.5-0.6-3.6-1.5c-1.3-1.1-2.9-2.4-6-2.4s-4.7,1.3-6,2.4c-1.1,0.9-1.9,1.5-3.6,1.5c-1.7,0-2.5-0.6-3.6-1.5
		c-1.3-1.1-2.9-2.4-6-2.4s-4.7,1.3-6,2.4c-1.1,0.9-1.9,1.5-3.6,1.5s-2.5-0.6-3.6-1.5c-1.3-1.1-2.9-2.4-6-2.4v3.9
		c1.7,0,2.5,0.6,3.6,1.5c1.3,1.1,2.9,2.4,6,2.4s4.7-1.3,6-2.4c1.1-0.9,1.9-1.5,3.6-1.5s2.5,0.6,3.6,1.5c1.3,1.1,2.9,2.4,6,2.4
		s4.7-1.3,6-2.4c1.1-0.9,1.9-1.5,3.6-1.5c1.7,0,2.5,0.6,3.6,1.5c1.3,1.1,2.9,2.4,6,2.4s4.7-1.3,6-2.4c1.1-0.9,1.9-1.5,3.6-1.5
		c1.7,0,2.5,0.6,3.6,1.5c1.3,1,3,2.4,6,2.4c3.1,0,4.7-1.3,6-2.4c1.1-0.9,1.9-1.5,3.6-1.5v-3.9c-3.1,0-4.7,1.3-6,2.4
		C83.9-121.6,83.1-121,81.4-121z"/>
	<path class="st0" d="M22.8-71.3l6.4-6.4l4.4,4.4c0.4,0.4,0.9,0.6,1.4,0.6c0.2,0,0.3,0,0.5-0.1c0.7-0.2,1.2-0.7,1.4-1.4l3.9-15.5
		c0.2-0.7,0-1.4-0.5-1.8c-0.5-0.5-1.2-0.7-1.8-0.5L23-88.1c-0.7,0.2-1.2,0.7-1.4,1.4c-0.2,0.7,0,1.4,0.5,1.9l4.4,4.4L20.1-74
		L22.8-71.3z M36.2-87.4l-2.3,9l-6.8-6.8L36.2-87.4z"/>
	<rect x="56.2" y="-76.6" width="3.9" height="3.9"/>
	<rect x="64" y="-76.6" width="3.9" height="3.9"/>
	<rect x="71.7" y="-76.6" width="3.9" height="3.9"/>
	<rect x="79.4" y="-76.6" width="3.9" height="3.9"/>
	<rect x="87.2" y="-76.6" width="3.9" height="3.9"/>
	<rect x="94.9" y="-76.6" width="3.9" height="3.9"/>
	<rect x="102.6" y="-76.6" width="3.9" height="3.9"/>
	<rect x="110.4" y="-76.6" width="3.9" height="3.9"/>
	<rect x="118.1" y="-76.6" width="3.9" height="3.9"/>
	<rect x="118.1" y="-84.3" width="3.9" height="3.9"/>
	<rect x="118.1" y="-92" width="3.9" height="3.9"/>
	<rect x="118.1" y="-99.8" width="3.9" height="3.9"/>
	<rect x="118.1" y="-107.5" width="3.9" height="3.9"/>
	<rect x="118.1" y="-115.2" width="3.9" height="3.9"/>
	<rect x="118.1" y="-123" width="3.9" height="3.9"/>
	<rect x="118.1" y="-130.7" width="3.9" height="3.9"/>
	<rect x="118.1" y="-138.4" width="3.9" height="3.9"/>
</g>
<g>
	<g>
		<g>
			<path d="M121.5,270.8c0.5-0.4,1.1-0.7,1.8-0.7c0.7,0,1.3,0.3,1.8,0.7l0,0c0.4,0.5,0.7,1.1,0.7,1.7c0,0.7-0.3,1.3-0.7,1.8l0,0
				c-0.5,0.4-1.1,0.7-1.7,0.7c-0.7,0-1.3-0.3-1.8-0.7l0,0c-0.4-0.5-0.7-1.1-0.7-1.7C120.7,271.9,121,271.2,121.5,270.8L121.5,270.8z
				 M122.5,273.3c0.2,0.2,0.5,0.3,0.7,0.3c0.3,0,0.5-0.1,0.7-0.3c0.2-0.2,0.3-0.5,0.3-0.7c0-0.3-0.1-0.5-0.3-0.7
				c-0.2-0.2-0.5-0.3-0.7-0.3c-0.3,0-0.6,0.1-0.7,0.3c-0.2,0.2-0.3,0.5-0.3,0.7S122.3,273.1,122.5,273.3z"/>
			<path d="M111.3,238.7c0.3,0.2,0.5,0.7,0.3,1c-0.1,0.1-0.2,0.2-0.3,0.3l-2.7,1.5c-0.3,0.2-0.8,0.1-1-0.3c-0.2-0.3-0.1-0.8,0.3-1
				l1.6-0.9l-1.6-0.9c-0.3-0.2-0.5-0.6-0.3-1c0.2-0.3,0.6-0.5,1-0.3L111.3,238.7z"/>
			<path d="M103.7,298.1c0.4,0,0.7,0.3,0.7,0.7c0,0.4-0.3,0.7-0.7,0.7h-3.8c-0.4,0-0.7-0.3-0.7-0.7c0-0.4,0.3-0.7,0.7-0.7H103.7z"/>
			<path d="M101.2,300.1c0.4,0,0.7,0.3,0.7,0.7c0,0.4-0.3,0.7-0.7,0.7H93c-0.4,0-0.7-0.3-0.7-0.7c0-0.4,0.3-0.7,0.7-0.7H101.2z"/>
			<path d="M45.2,213.9c-0.1-0.4,0.1-0.8,0.5-0.9l1.3-0.3c0.4-0.1,0.8,0.1,0.9,0.5c0.1,0.4-0.1,0.8-0.5,0.9l-1.3,0.4
				C45.7,214.5,45.3,214.3,45.2,213.9z"/>
			<path d="M44.8,214.5c0.4-0.1,0.8,0.1,0.9,0.5l0.3,1.3c0.1,0.4-0.1,0.8-0.5,0.9c-0.4,0.1-0.8-0.1-0.9-0.5l-0.3-1.3
				C44.2,215,44.5,214.6,44.8,214.5z"/>
			<path d="M45.1,212.6c0.1,0.4-0.1,0.8-0.5,0.9c-0.4,0.1-0.8-0.1-0.9-0.5l-0.3-1.2c-0.1-0.4,0.1-0.8,0.5-0.9
				c0.4-0.1,0.8,0.1,0.9,0.5L45.1,212.6z"/>
			<path d="M45.3,301.5c-0.1-0.1-0.2-0.2-0.3-0.2s-0.2,0.1-0.3,0.2s-0.1,0.2-0.1,0.3c0,0.1,0.1,0.2,0.1,0.3c0.1,0.1,0.2,0.1,0.3,0.1
				s0.3,0,0.3-0.1c0.1-0.1,0.1-0.2,0.1-0.3C45.5,301.7,45.4,301.5,45.3,301.5z M45,299.9c0.5,0,1,0.2,1.4,0.6
				c0.3,0.3,0.6,0.8,0.6,1.4c0,0.5-0.2,1-0.6,1.4c-0.3,0.3-0.8,0.6-1.4,0.6c-0.5,0-1-0.2-1.4-0.6c-0.4-0.3-0.6-0.8-0.6-1.4
				c0-0.5,0.2-1,0.6-1.4C44,300.1,44.5,299.9,45,299.9z"/>
			<path d="M42,214l1.3-0.3c0.4-0.1,0.8,0.1,0.9,0.5c0.1,0.4-0.1,0.8-0.5,0.9l-1.3,0.4c-0.4,0.1-0.8-0.1-0.9-0.5
				C41.4,214.5,41.6,214.1,42,214z"/>
			<path d="M124.6,264.2L37,220.8l61.8,54.7L124.6,264.2z M80.3,284.8l-46.1-63.3L56.4,300L80.3,284.8z M97.7,276.6l-60.8-53.9
				l44.9,61.7l10.9,9L97.7,276.6z M126.6,264.9L99.1,277l-5.3,17.9c0,0.1-0.1,0.2-0.1,0.3c-0.3,0.3-0.7,0.4-1,0.1l-11.4-9.4
				l-24.9,15.8c-0.1,0-0.1,0.1-0.2,0.1c-0.4,0.1-0.8-0.1-0.9-0.5L31.7,218c0-0.1,0-0.2,0-0.3s0-0.2,0.1-0.3c0-0.1,0.1-0.2,0.2-0.2
				c0.1-0.1,0.1-0.1,0.2-0.1c0.1,0,0.2,0,0.3,0l94.1,46.5c0.2,0.1,0.3,0.2,0.4,0.4C127.1,264.3,127,264.8,126.6,264.9z"/>
			<polygon points="34.1,242.6 32.7,243 32.3,241.7 33.7,241.3 			"/>
			<polygon points="31.3,243.4 32.7,243 33.1,244.3 31.7,244.7 			"/>
			<polygon points="30.5,240.8 31.9,240.4 32.3,241.7 30.9,242.1 30.9,242.1 			"/>
			<polygon points="30.9,242.1 31.3,243.4 29.9,243.8 29.5,242.5 			"/>
		</g>
	</g>
</g>
<g>
	<g>
		<g>
			<path d="M79.8,136.2H31.1c-4.1,0-7.4-3.3-7.4-7.4v-94c0-4.1,3.3-7.4,7.4-7.4h48.7c4.1,0,7.4,3.3,7.4,7.4v19.9
				c0,0.7-0.6,1.3-1.3,1.3s-1.3-0.6-1.3-1.3V34.8c0-2.6-2.1-4.8-4.8-4.8H31.1c-2.6,0-4.8,2.1-4.8,4.8v94c0,2.6,2.1,4.8,4.8,4.8h48.7
				c2.6,0,4.8-2.1,4.8-4.8V88c0-0.7,0.6-1.3,1.3-1.3s1.3,0.6,1.3,1.3v40.8C87.2,132.8,83.9,136.2,79.8,136.2z"/>
		</g>
		<g>
			<path d="M55.5,130.3c-3,0-5.5-2.4-5.5-5.5c0-3,2.4-5.5,5.5-5.5c3,0,5.5,2.4,5.5,5.5C60.9,127.8,58.5,130.3,55.5,130.3z M55.5,122
				c-1.6,0-2.8,1.2-2.8,2.8c0,1.6,1.3,2.8,2.8,2.8s2.8-1.3,2.8-2.8S57,122,55.5,122z"/>
		</g>
		<g>
			<path d="M80.4,115.8H30.5c-0.7,0-1.3-0.6-1.3-1.3V43.1c0-0.7,0.6-1.3,1.3-1.3h49.9c0.7,0,1.3,0.6,1.3,1.3v12.2
				c0,0.7-0.6,1.3-1.3,1.3s-1.3-0.6-1.3-1.3V44.4H31.8v68.7h47.3v-25c0-0.7,0.6-1.3,1.3-1.3s1.3,0.6,1.3,1.3v26.4
				C81.8,115.2,81.2,115.8,80.4,115.8z"/>
		</g>
		<g>
			<path d="M64.2,37.8h-3.3c-0.5,0-1-0.3-1.2-0.8c-0.2,0.4-0.7,0.8-1.2,0.8H46.9c-0.7,0-1.3-0.6-1.3-1.3s0.6-1.3,1.3-1.3h11.6
				c0.5,0,1,0.3,1.2,0.8c0.2-0.4,0.7-0.8,1.2-0.8h3.3c0.7,0,1.3,0.6,1.3,1.3S64.9,37.8,64.2,37.8z"/>
		</g>
		<g>
			<path class="st0" d="M101.3,89.2h-36c-0.7,0-1.3-0.6-1.3-1.3V67.2c0-0.7,0.6-1.3,1.3-1.3s1.3,0.6,1.3,1.3v19.3H100V67.2
				c0-0.7,0.6-1.3,1.3-1.3c0.7,0,1.3,0.6,1.3,1.3v20.7C102.7,88.6,102.1,89.2,101.3,89.2z"/>
		</g>
		<g>
			<path class="st0" d="M83.4,82.8c-0.3,0-0.6-0.1-0.8-0.3L64.5,68.2c-0.6-0.5-0.7-1.3-0.2-1.9c0.5-0.6,1.3-0.7,1.9-0.2l17.2,13.6
				l17.2-13.6c0.6-0.5,1.4-0.4,1.9,0.2c0.5,0.6,0.4,1.4-0.2,1.9l-18,14.3C84,82.7,83.7,82.8,83.4,82.8z"/>
		</g>
		<g>
			<path class="st0" d="M101.3,89.2L101.3,89.2H65.2c-0.6,0-1.1-0.4-1.2-0.9c-0.2-0.5,0-1.1,0.4-1.5l12.8-10.6
				c0.6-0.5,1.4-0.4,1.9,0.2c0.5,0.6,0.4,1.4-0.2,1.9L69,86.5h28.6l-9.9-8.1c-0.6-0.5-0.7-1.3-0.2-1.9c0.5-0.6,1.3-0.6,1.9-0.2
				l12.8,10.5c0.4,0.4,0.6,1,0.4,1.5S101.9,89.2,101.3,89.2z"/>
		</g>
		<g>
			<path class="st0" d="M65.3,68.5c-0.4,0-0.8-0.2-1-0.5c-0.5-0.6-0.4-1.4,0.2-1.9l18.1-14.3c0.5-0.4,1.2-0.4,1.7,0l18,14.3
				c0.6,0.5,0.7,1.3,0.2,1.9c-0.4,0.6-1.3,0.7-1.9,0.2L83.4,54.6L66.2,68.2C65.9,68.4,65.6,68.5,65.3,68.5z"/>
		</g>
		<g>
			<path class="st0" d="M88.8,65H75.6c-0.7,0-1.3-0.6-1.3-1.3s0.6-1.3,1.3-1.3h13.2c0.7,0,1.3,0.6,1.3,1.3S89.5,65,88.8,65z"/>
		</g>
		<g>
			<path class="st0" d="M84.1,68.9h-8.6c-0.7,0-1.3-0.6-1.3-1.3s0.6-1.3,1.3-1.3h8.6c0.7,0,1.3,0.6,1.3,1.3S84.9,68.9,84.1,68.9z"/>
		</g>
		<g>
			<path class="st0" d="M88.8,72.6h-9.7c-0.7,0-1.3-0.6-1.3-1.3s0.6-1.3,1.3-1.3h9.7c0.7,0,1.3,0.6,1.3,1.3S89.5,72.6,88.8,72.6z"/>
		</g>
	</g>
</g>
<g>
	<g>
		<g>
			<path d="M781.3,292.1h-48.7c-4.1,0-7.4-3.3-7.4-7.4v-94c0-4.1,3.3-7.4,7.4-7.4h48.7c4.1,0,7.4,3.3,7.4,7.4v19.9
				c0,0.7-0.6,1.3-1.3,1.3s-1.3-0.6-1.3-1.3v-19.9c0-2.6-2.1-4.8-4.8-4.8h-48.7c-2.6,0-4.8,2.1-4.8,4.8v94c0,2.6,2.1,4.8,4.8,4.8
				h48.7c2.6,0,4.8-2.1,4.8-4.8v-40.8c0-0.7,0.6-1.3,1.3-1.3s1.3,0.6,1.3,1.3v40.8C788.7,288.8,785.4,292.1,781.3,292.1z"/>
		</g>
		<g>
			<path d="M757,286.3c-3,0-5.5-2.4-5.5-5.5c0-3,2.4-5.5,5.5-5.5c3,0,5.5,2.4,5.5,5.5C762.4,283.8,759.9,286.3,757,286.3z M757,278
				c-1.6,0-2.8,1.2-2.8,2.8c0,1.6,1.3,2.8,2.8,2.8s2.8-1.3,2.8-2.8C759.7,279.3,758.5,278,757,278z"/>
		</g>
		<g>
			<path d="M781.9,271.8H732c-0.7,0-1.3-0.6-1.3-1.3v-71.4c0-0.7,0.6-1.3,1.3-1.3h49.9c0.7,0,1.3,0.6,1.3,1.3v12.2
				c0,0.7-0.6,1.3-1.3,1.3s-1.3-0.6-1.3-1.3v-10.9h-47.3v68.7h47.3v-25c0-0.7,0.6-1.3,1.3-1.3s1.3,0.6,1.3,1.3v26.4
				C783.2,271.2,782.6,271.8,781.9,271.8z"/>
		</g>
		<g>
			<path d="M765.6,193.8h-3.3c-0.5,0-1-0.3-1.2-0.8c-0.2,0.4-0.7,0.8-1.2,0.8h-11.6c-0.7,0-1.3-0.6-1.3-1.3s0.6-1.3,1.3-1.3h11.6
				c0.5,0,1,0.3,1.2,0.8c0.2-0.4,0.7-0.8,1.2-0.8h3.3c0.7,0,1.3,0.6,1.3,1.3C767,193.2,766.4,193.8,765.6,193.8z"/>
		</g>
		<g>
			<path d="M802.8,245.1h-36c-0.7,0-1.3-0.6-1.3-1.3v-20.7c0-0.7,0.6-1.3,1.3-1.3s1.3,0.6,1.3,1.3v19.3h33.4v-19.3
				c0-0.7,0.6-1.3,1.3-1.3s1.3,0.6,1.3,1.3v20.7C804.1,244.5,803.5,245.1,802.8,245.1z"/>
		</g>
		<g>
			<path d="M784.8,238.8c-0.3,0-0.6-0.1-0.8-0.3l-18-14.3c-0.6-0.5-0.7-1.3-0.2-1.9c0.5-0.6,1.3-0.7,1.9-0.2l17.2,13.6l17.2-13.6
				c0.6-0.5,1.4-0.4,1.9,0.2c0.5,0.6,0.4,1.4-0.2,1.9l-18,14.3C785.4,238.7,785.1,238.8,784.8,238.8z"/>
		</g>
		<g>
			<path d="M802.8,245.1L802.8,245.1h-36.1c-0.6,0-1.1-0.4-1.2-0.9c-0.2-0.5,0-1.1,0.4-1.5l12.8-10.6c0.6-0.5,1.4-0.4,1.9,0.2
				s0.4,1.4-0.2,1.9l-9.9,8.2h28.6l-9.9-8.1c-0.6-0.5-0.7-1.3-0.2-1.9c0.5-0.6,1.3-0.6,1.9-0.2l12.8,10.5c0.4,0.4,0.6,1,0.4,1.5
				C803.9,244.8,803.4,245.1,802.8,245.1z"/>
		</g>
		<g>
			<path d="M766.8,224.5c-0.4,0-0.8-0.2-1-0.5c-0.5-0.6-0.4-1.4,0.2-1.9l18.1-14.3c0.5-0.4,1.2-0.4,1.7,0l18,14.3
				c0.6,0.5,0.7,1.3,0.2,1.9s-1.3,0.7-1.9,0.2l-17.2-13.6l-17.2,13.6C767.4,224.4,767.1,224.5,766.8,224.5z"/>
		</g>
		<g>
			<path d="M790.2,221H777c-0.7,0-1.3-0.6-1.3-1.3s0.6-1.3,1.3-1.3h13.2c0.7,0,1.3,0.6,1.3,1.3S790.9,221,790.2,221z"/>
		</g>
		<g>
			<path d="M785.6,224.9H777c-0.7,0-1.3-0.6-1.3-1.3s0.6-1.3,1.3-1.3h8.6c0.7,0,1.3,0.6,1.3,1.3S786.3,224.9,785.6,224.9z"/>
		</g>
		<g>
			<path d="M790.2,228.5h-9.7c-0.7,0-1.3-0.6-1.3-1.3s0.6-1.3,1.3-1.3h9.7c0.7,0,1.3,0.6,1.3,1.3S790.9,228.5,790.2,228.5z"/>
		</g>
	</g>
</g>
<g transform="translate(0,-280.06669)">
	<path d="M-29.4,497.6c-0.4,0-0.9,0.1-1.3,0.2l-100.8,36c-1.9,0.7-2.9,2.7-2.2,4.6c0.4,1.1,1.3,1.9,2.4,2.3l48.5,13.8L-69,603
		c0.5,1.9,2.5,3,4.5,2.5c1.1-0.3,2-1.2,2.4-2.3l36-100.8c0.7-1.9-0.3-3.9-2.2-4.6C-28.6,497.6-29,497.6-29.4,497.6z M-35.3,507.1
		L-65,590.2l-10.7-37.6l12.9-12.9c1.4-1.4,1.5-3.7,0.1-5.1c-0.7-0.7-1.7-1.1-2.7-1.1c-0.9,0-1.8,0.4-2.5,1.1l-12.9,12.9l-37.6-10.7
		L-35.3,507.1z M-108.7,555.1L-108.7,555.1c-1,0-1.9,0.4-2.5,1.1l-7.2,7.2c-1.5,1.4-1.5,3.6-0.2,5.1c1.4,1.5,3.6,1.5,5.1,0.2
		c0.1-0.1,0.1-0.1,0.2-0.2l7.2-7.2c1.4-1.4,1.5-3.7,0.1-5.1C-106.7,555.5-107.7,555.1-108.7,555.1z M-94.3,562.3
		c-0.9,0-1.8,0.4-2.5,1.1l-14.4,14.4c-1.4,1.4-1.5,3.7-0.1,5.1c1.4,1.4,3.7,1.5,5.1,0.1l0.1-0.1l14.4-14.4c1.4-1.4,1.5-3.7,0.1-5.1
		C-92.3,562.7-93.3,562.3-94.3,562.3z M-87.1,576.7c-0.9,0-1.8,0.4-2.5,1.1l-7.2,7.2c-1.5,1.4-1.5,3.6-0.2,5.1
		c1.4,1.5,3.6,1.5,5.1,0.2c0.1-0.1,0.1-0.1,0.2-0.2l7.2-7.2c1.4-1.4,1.5-3.7,0.1-5.1C-85.1,577.1-86.1,576.7-87.1,576.7z
		 M-115.8,584c-2,0-3.6,1.6-3.6,3.6l0,0c0,2,1.6,3.6,3.6,3.6l0,0c2,0,3.6-1.6,3.6-3.6l0,0C-112.2,585.6-113.8,584-115.8,584
		L-115.8,584z"/>
</g>
<g>
	<path d="M-182.3,228c-1.8-1.3-4.2-1.6-6.4-0.4l-47.7,27.5c-2.4,1.4-3.3,4-2.9,6.3c0.4,2.3,2.3,4.4,5,4.8l22,3.2
		c0.6,0.1,1.2,0.5,1.5,1l10.6,19.5c1.3,2.4,3.9,3.4,6.2,3.1c2.3-0.4,4.5-2.2,4.9-4.9l9.2-54.3C-179.3,231.4-180.5,229.2-182.3,228z
		 M-187,231.3l-24,34.4c-0.2-0.1-0.5-0.2-0.7-0.2l-22-3.2c-1-0.2-1.5-0.8-1.7-1.6c-0.2-0.8,0.1-1.6,1-2.1L-187,231.3z M-183.7,233.6
		l-9.2,53.9c-0.2,1-0.8,1.5-1.7,1.7c-0.8,0.1-1.6-0.1-2.1-1l-10.6-19.5c-0.1-0.2-0.3-0.4-0.4-0.6L-183.7,233.6z M-216.7,270.4
		c-0.1,0-0.1-0.1-0.2-0.1c-0.9-0.5-2-0.2-2.6,0.6l-4.6,6.6c-0.6,0.9-0.4,2.2,0.5,2.8c0.9,0.6,2.2,0.4,2.8-0.5l4.6-6.6
		C-215.5,272.3-215.8,271.1-216.7,270.4L-216.7,270.4L-216.7,270.4z M-210.1,275c-0.1,0-0.1-0.1-0.2-0.1c-0.9-0.5-2-0.2-2.6,0.6
		l-11.4,16.4c-0.6,0.9-0.4,2.2,0.5,2.8s2.2,0.4,2.8-0.5l0,0l11.4-16.4C-209,276.9-209.2,275.6-210.1,275L-210.1,275L-210.1,275z
		 M-225.5,269.1c-0.1,0-0.1-0.1-0.2-0.1c-0.9-0.5-2.1-0.2-2.6,0.7l-6.9,9.8c-0.6,0.9-0.4,2.2,0.5,2.8c0.9,0.6,2.1,0.4,2.8-0.5
		l6.9-9.8C-224.4,271.1-224.6,269.8-225.5,269.1L-225.5,269.1L-225.5,269.1z M-205.9,282.8c-0.1,0-0.1-0.1-0.2-0.1
		c-0.9-0.5-2.1-0.2-2.6,0.7l-4.6,6.6c-0.7,0.8-0.6,2.1,0.2,2.8c0.8,0.7,2.1,0.6,2.8-0.2c0.1-0.1,0.1-0.2,0.2-0.3l4.6-6.6
		C-204.7,284.8-204.9,283.5-205.9,282.8C-205.8,282.8-205.8,282.8-205.9,282.8L-205.9,282.8z M-225.8,283.5
		c-0.9-0.6-2.2-0.4-2.8,0.5l0,0l-4.6,6.6c-0.6,0.9-0.4,2.2,0.5,2.8c0.9,0.6,2.2,0.4,2.8-0.5l4.6-6.6
		C-224.7,285.5-224.9,284.2-225.8,283.5C-225.8,283.6-225.8,283.5-225.8,283.5L-225.8,283.5z M-215,295.9c-0.1,0-0.1-0.1-0.2-0.1
		c-0.9-0.5-2.1-0.2-2.6,0.7l-2.3,3.3c-0.7,0.8-0.6,2.1,0.2,2.8c0.8,0.7,2.1,0.6,2.8-0.2c0.1-0.1,0.1-0.2,0.2-0.3l2.3-3.3
		C-213.9,297.9-214.1,296.6-215,295.9C-215,296-215,296-215,295.9L-215,295.9z"/>
</g>
<g transform="translate(0,-952.36215)">
	<path d="M396.3,974.9c-24.3,0-44,19.7-44,44c0,24.3,19.7,44,44,44s44-19.7,44-44C440.3,994.7,420.6,974.9,396.3,974.9z
		 M396.3,978.9c22.1,0,40,17.9,40,40s-17.9,40-40,40s-40-17.9-40-40S374.2,978.9,396.3,978.9z M416.2,1003.3c-0.5,0-1,0.3-1.3,0.7
		l-24,25.2c-0.9-1.4-1.9-2.7-3.3-4c-2.2-2-4.9-3.8-7.8-4.5c-1.1-0.3-2.2,0.3-2.5,1.3c-0.3,1.1,0.3,2.2,1.3,2.5c0.1,0,0.1,0,0.2,0.1
		c2,0.5,4.2,1.9,6.1,3.6c1.8,1.7,3.2,3.7,3.6,5c0.3,1,1.5,1.6,2.5,1.3c0.3-0.1,0.6-0.3,0.8-0.5l25.9-27.2c0.8-0.8,0.8-2.1,0-2.8
		C417.3,1003.5,416.7,1003.3,416.2,1003.3z"/>
</g>
<g>
	<path d="M41.9,409.7c0.6,0.1,1.3,0.4,1.8,0.8l1.4,1.2c1.3,1.1,1.5,2.7,0.7,3.6s-2.4,1-3.7-0.1l-1.4-1.2c-1.3-1.1-1.5-2.8-0.7-3.6
		C40.6,409.9,41.3,409.7,41.9,409.7z M45.9,403.2c0.7,0,1.4,0.2,2,0.7l2.3,1.9c1.2,1,1.4,2.8,0.3,4c-1,1.2-2.8,1.3-4,0.3l-2.3-1.9
		c-1.2-1-1.4-2.9-0.3-4C44.4,403.6,45.2,403.3,45.9,403.2z M50,396.6c0.7,0,1.4,0.2,2,0.7l3.1,2.7c1.2,1,1.4,2.8,0.3,4
		c-1,1.2-2.8,1.4-4,0.3c-1-0.9-2.1-1.8-3.1-2.7c-1.2-1-1.4-2.9-0.3-4C48.6,397,49.3,396.6,50,396.6z M55,390.7c0.7,0,1.4,0.2,2,0.7
		l3.1,2.7c1.2,1,1.4,2.8,0.3,4c-1,1.2-2.8,1.4-4,0.3l-3.1-2.7c-1.2-1-1.4-2.9-0.3-4C53.6,391.1,54.3,390.8,55,390.7z M54.8,388.8
		c-1.2,0.1-2.5,0.7-3.3,1.7c-1,1.2-1.3,2.8-1,4.2c-1.5-0.1-3,0.5-4,1.7c-1.2,1.4-1.4,3.3-0.8,4.9c-1.2,0.1-2.5,0.7-3.3,1.7
		c-1.2,1.4-1.4,3.2-0.9,4.8c-1.1,0-2.2,0.5-2.9,1.4c-1.5,1.7-1.1,4.3,0.5,6l-9.2,8.4c-1.1,0.9,0.4,2.5,1.3,1.5l9.4-8.6l0.3,0.2
		c2,1.7,4.9,1.8,6.5-0.1c0.9-1.1,1.1-2.5,0.8-3.8c1.4,0.1,2.9-0.5,3.9-1.7s1.3-2.8,1-4.2c1.5,0.1,3-0.5,4-1.7s1.3-2.8,1-4.2
		c1.5,0.1,3-0.5,4-1.7c1.7-2,1.5-5.1-0.5-6.9l-3.1-2.7C57.3,389.1,56,388.7,54.8,388.8z"/>
	<path d="M80,384.9l3,0.1c1.1,0,1.8,0.4,2.2,1.1l1.1,2.1l-4-0.2L80,384.9z M73.1,380.6c1,0,1.9,0.6,2.6,1.6l4.1,5.8l-7.8-0.3
		l0.8-0.6c0.8-0.6,0.3-1.8-0.6-1.8c-0.2,0-0.4,0.1-0.6,0.2l-2.6,2.1l-3.6,0.2c-1.9,0.1-3.2-0.8-3.7-1.6c-0.5-1-0.4-1.1,0.4-1.3
		c3.5-0.9,5.6-1.5,9-3.6C71.8,380.8,72.5,380.6,73.1,380.6z M70,379.5c-3.4,2.1-5,2.6-8.8,3.5c-0.9,0.2-1.6,1-1.8,1.8
		s0.1,1.7,0.6,2.4c0.9,1.5,2.9,2.7,5.5,2.6l3.8-0.2l18.4,0.8c1.6,0.1,2.5,1.2,2.8,2.5c0.3,1.2,0.4,2.7-0.7,2.8l-14.3,1.8
		c-1.4,0.1-1.1,2.2,0.3,2l14.2-1.8c1.6,0,2.5,1.5,2.7,2.6c0.2,1,0,2.4-1.4,2.7L79,405.4c-1.4,0.2-1,2.3,0.4,2l12.2-2.5
		c1-0.2,2.1,0.7,2.3,1.7c0.3,2.1-0.4,2.9-1.8,3.4l-12.6,4.2c-1.3,0.4-0.6,2.3,0.6,1.9l12.6-4.3c0.9-0.3,1.4-0.2,1.9,0.1
		c0.4,0.3,0.8,0.7,1,1.3c0.3,1.2,0,2.6-1.3,3.2c-4.8,2.3-17,7.4-17,7.4l-15.1,4.8c-0.1,0-0.3,0.1-0.4,0.2l-14.9,13.6
		c-1,0.9,0.4,2.4,1.4,1.5L63,430.4l15-4.8c0,0,12.2-5.1,17.2-7.4c0.4-0.2,0.7-0.4,0.9-0.6l11,7.1c1.1,0.7,2.2-1,1.1-1.7l-10.9-7
		c0.5-1.1,0.6-2.3,0.2-3.3c-0.5-1.4-1.2-2.1-2.3-2.6c0.9-1.3,1-2.8,0.6-4.1c-0.4-1.1-1.1-2-2.1-2.6c0.8-1,1.1-2.4,0.9-3.6
		c-0.3-1.4-1.2-2.7-2.7-3.5c0.7-1.2,0.8-2.7,0.5-3.9c-0.4-1.7-1.7-3.4-3.7-3.9l-1.7-3.2c-0.4-0.7-0.9-1.3-1.5-1.7
		c-0.7-0.4-1.5-0.5-2.4-0.6l-4.5-0.2l0,0l-1.3-1.8c-0.7-1-1.6-2.2-3.5-2.4C71.9,378.4,70.9,379,70,379.5z"/>
	<path d="M72.7,432.8l8.5,2.6l13.5,8.6c1.2,0.9,2.3-1,1.1-1.7l-13.7-8.8l-8.8-2.7C72.1,430.5,71.7,432.4,72.7,432.8z"/>
</g>
<path d="M335.4,409.7c0.6,0.1,1.3,0.4,1.8,0.8l1.4,1.2c1.3,1.1,1.5,2.7,0.7,3.6s-2.4,1-3.7-0.1l-1.4-1.2c-1.3-1.1-1.5-2.8-0.7-3.6
	C334.1,409.9,334.8,409.7,335.4,409.7z M339.4,403.2c0.7,0,1.4,0.2,2,0.7l2.3,1.9c1.2,1,1.4,2.8,0.3,4c-1,1.2-2.8,1.3-4,0.3
	l-2.3-1.9c-1.2-1-1.4-2.9-0.3-4C337.9,403.6,338.7,403.3,339.4,403.2z M343.5,396.6c0.7,0,1.4,0.2,2,0.7l3.1,2.7
	c1.2,1,1.4,2.8,0.3,4c-1,1.2-2.8,1.4-4,0.3c-1-0.9-2.1-1.8-3.1-2.7c-1.2-1-1.4-2.9-0.3-4C342.1,397,342.8,396.6,343.5,396.6z
	 M348.5,390.7c0.7,0,1.4,0.2,2,0.7l3.1,2.7c1.2,1,1.4,2.8,0.3,4c-1,1.2-2.8,1.4-4,0.3l-3.1-2.7c-1.2-1-1.4-2.9-0.3-4
	C347.1,391.1,347.8,390.8,348.5,390.7z M348.3,388.8c-1.2,0.1-2.5,0.7-3.3,1.7c-1,1.2-1.4,2.8-1,4.2c-1.5-0.1-3,0.5-4,1.7
	c-1.2,1.4-1.4,3.3-0.8,4.9c-1.2,0.1-2.5,0.7-3.3,1.7c-1.2,1.4-1.4,3.2-0.9,4.8c-1.1,0-2.2,0.5-2.9,1.4c-1.5,1.7-1.1,4.3,0.5,6
	l-9.2,8.4c-1.1,0.9,0.4,2.5,1.3,1.5l9.4-8.6l0.3,0.2c2,1.7,4.9,1.8,6.5-0.1c0.9-1.1,1.1-2.5,0.8-3.8c1.4,0.1,2.9-0.5,3.9-1.7
	s1.4-2.8,1-4.2c1.5,0.1,3-0.5,4-1.7s1.3-2.8,1-4.2c1.5,0.1,3-0.5,4-1.7c1.7-2,1.5-5.1-0.5-6.9l-3.1-2.7
	C350.8,389.1,349.5,388.7,348.3,388.8z"/>
<path d="M373.5,384.9l3,0.1c1.1,0,1.8,0.4,2.2,1.1l1.1,2.1l-4-0.2L373.5,384.9z M366.6,380.6c1,0,1.9,0.6,2.6,1.6l4.1,5.8l-7.8-0.3
	l0.8-0.6c0.8-0.6,0.3-1.8-0.6-1.8c-0.2,0-0.4,0.1-0.6,0.2l-2.6,2.1l-3.6,0.2c-1.9,0.1-3.2-0.8-3.7-1.6c-0.5-1-0.4-1.1,0.4-1.3
	c3.5-0.9,5.6-1.5,9-3.6C365.3,380.8,366,380.6,366.6,380.6z M363.5,379.5c-3.4,2.1-5,2.6-8.8,3.5c-0.9,0.2-1.6,1-1.8,1.8
	c-0.2,0.8,0.1,1.7,0.6,2.4c0.9,1.5,2.9,2.7,5.5,2.6l3.8-0.2l18.4,0.8c1.6,0.1,2.5,1.2,2.8,2.5c0.3,1.2,0.4,2.7-0.7,2.8l-14.3,1.8
	c-1.4,0.1-1.1,2.2,0.3,2l14.2-1.8c1.6,0,2.5,1.5,2.7,2.6c0.2,1,0,2.4-1.4,2.7l-12.2,2.5c-1.4,0.2-1,2.3,0.4,2l12.2-2.5
	c1-0.2,2.1,0.7,2.3,1.7c0.3,2.1-0.4,2.9-1.8,3.4l-12.6,4.2c-1.3,0.4-0.6,2.3,0.6,1.9l12.6-4.3c0.9-0.3,1.4-0.2,1.9,0.1
	c0.4,0.3,0.8,0.7,1,1.3c0.4,1.2,0,2.6-1.3,3.2c-4.8,2.3-17,7.4-17,7.4l-15.1,4.8c-0.1,0-0.3,0.1-0.4,0.2l-14.9,13.6
	c-1,0.9,0.4,2.4,1.3,1.5l14.8-13.5l15-4.8c0,0,12.2-5.1,17.2-7.4c0.4-0.2,0.7-0.4,0.9-0.6l11,7.1c1.1,0.7,2.2-1,1.1-1.7l-10.9-7
	c0.5-1.1,0.6-2.3,0.2-3.3c-0.5-1.4-1.2-2.1-2.3-2.6c0.9-1.3,1-2.8,0.6-4.1c-0.4-1.1-1.1-2-2.1-2.6c0.8-1,1.1-2.4,0.9-3.6
	c-0.3-1.4-1.2-2.7-2.7-3.5c0.7-1.2,0.8-2.7,0.5-3.9c-0.4-1.7-1.7-3.4-3.7-3.9l-1.7-3.2c-0.4-0.7-0.9-1.3-1.5-1.7
	c-0.7-0.4-1.5-0.5-2.4-0.6l-4.5-0.2l0,0l-1.3-1.8c-0.7-1-1.6-2.2-3.5-2.4C365.4,378.4,364.4,379,363.5,379.5z"/>
<path d="M366.2,432.8l8.5,2.6l13.5,8.6c1.2,0.9,2.3-1,1.1-1.7l-13.7-8.8l-8.8-2.7C365.6,430.5,365.2,432.4,366.2,432.8z"/>
<g>
	<g>
		<path d="M244.6,418.7c-1.3-3-4.8-4.2-7.8-2.9l-18.5,8.2c0.1-0.4,0.1-0.7,0.1-1.1c0-3.3-2.7-6-6-6h-13.7c-3.7,0-5.4-2-10.3-4.5
			c-1.1-0.6-2.3-0.9-3.5-0.9h-1.5v-4.1c0-0.7-0.6-1.2-1.2-1.2h-15.6c-0.7,0-1.2,0.6-1.2,1.2v30.2c0,0.7,0.6,1.2,1.2,1.2h15.6
			c0.7,0,1.2-0.6,1.2-1.2v-3l10.5,4.8c8.3,3.1,17.3,2.4,24.7-1.3l23.3-11.7C244.7,424.9,245.9,421.6,244.6,418.7z M180.8,436.3
			h-13.1v-27.7h13.1V436.3z M240.8,424.1l-23.3,11.7c-7,3.5-15.5,3.9-22.7,1.2l-11.5-5.2V414h1.5c0.8,0,1.6,0.2,2.3,0.6
			c4.7,2.4,6.9,4.8,11.5,4.8h13.7c1.9,0,3.5,1.6,3.5,3.5s-1.6,3.5-3.5,3.5h-16.2c-0.7,0-1.2,0.6-1.2,1.2s0.6,1.2,1.2,1.2h16.2
			c1.2,0,2.3-0.4,3.3-1l22.1-9.8c1.8-0.8,3.8-0.1,4.5,1.6C243.1,421.4,242.4,423.3,240.8,424.1z"/>
		<path d="M174.3,417.9c1.7,0,3-1.3,3-3s-1.4-3-3-3c-1.7,0-3,1.4-3,3C171.2,416.5,172.6,417.9,174.3,417.9z"/>
	</g>
</g>
<g transform="translate(0,-952.36218)">
	<path d="M211.9,1330.1c-2.6,0-5.1,1-7,3.1c-3.9,4.1-3.9,10.6,0,14.7l15.5,16.3c0.4,0.4,1,0.4,1.4,0l0,0
		c5.2-5.4,10.4-10.9,15.5-16.3c3.9-4.1,3.9-10.6,0-14.7s-10.2-4.1-14.1,0l-2.2,2.3l-2.2-2.3C217,1331.2,214.5,1330.1,211.9,1330.1z
		 M211.9,1332.1c2,0,4.1,0.8,5.6,2.5l2.9,3c0.4,0.4,1,0.4,1.4,0l0,0l2.9-3c3.1-3.3,8.1-3.3,11.2,0c3.1,3.3,3.1,8.7,0,12
		c-4.9,5.2-9.9,10.4-14.8,15.6l-14.8-15.6c-3.1-3.3-3.1-8.7,0-12C207.9,1332.9,209.9,1332.1,211.9,1332.1L211.9,1332.1z"/>
</g>
<g>
	<g>
		<g>
			<path d="M821.9,394.8c-1.9-4.1-6.7-5.9-10.9-4l-25.7,11.4c0.1-0.5,0.1-1,0.1-1.5c0-4.6-3.7-8.3-8.3-8.3H758
				c-5.1,0-7.5-2.8-14.3-6.3c-1.5-0.9-3.2-1.3-4.9-1.3h-2.1v-5.7c0-1-0.8-1.7-1.7-1.7h-21.7c-1,0-1.7,0.8-1.7,1.7v42
				c0,1,0.8,1.7,1.7,1.7H735c1,0,1.7-0.8,1.7-1.7v-4.2l14.7,6.6c11.5,4.3,24,3.4,34.4-1.8l32.4-16.2
				C822.1,403.5,823.7,398.8,821.9,394.8z M733.3,419.3H715v-38.5h18.2L733.3,419.3L733.3,419.3z M816.6,402.4l-32.4,16.2
				c-9.7,4.9-21.6,5.4-31.5,1.7l-16-7.2v-24.8h2.1c1.1,0,2.2,0.3,3.2,0.8c6.5,3.3,9.6,6.7,16,6.7h19.1c2.7,0,4.8,2.2,4.8,4.8
				c0,2.7-2.2,4.8-4.8,4.8h-22.5c-1,0-1.7,0.8-1.7,1.7s0.8,1.7,1.7,1.7h22.5c1.7,0,3.3-0.5,4.6-1.4l30.7-13.6
				c2.5-1.1,5.2-0.1,6.3,2.3C819.8,398.5,818.9,401.2,816.6,402.4z"/>
			<path d="M724.1,393.7c2.3,0,4.2-1.9,4.2-4.2s-1.9-4.2-4.2-4.2s-4.2,1.9-4.2,4.2S721.8,393.7,724.1,393.7z"/>
		</g>
	</g>
	<g transform="translate(0,-952.36218)">
		<path class="st1" d="M776.5,1290.3c-3.6,0-7.1,1.4-9.8,4.2c-5.4,5.7-5.4,14.7,0,20.4l21.6,22.7c0.5,0.5,1.4,0.6,1.9,0.1
			c0,0,0,0,0.1-0.1c7.2-7.6,14.4-15.1,21.6-22.7c5.4-5.7,5.4-14.7,0-20.4c-5.4-5.7-14.2-5.7-19.6,0l-3,3.1l-3-3.2
			C783.6,1291.7,780.1,1290.3,776.5,1290.3z M776.5,1293c2.8,0,5.6,1.1,7.8,3.4l4,4.2c0.5,0.5,1.4,0.6,1.9,0.1c0,0,0,0,0.1-0.1
			l4-4.2c4.4-4.6,11.3-4.6,15.6,0c4.4,4.6,4.4,12,0,16.6c-6.9,7.2-13.7,14.4-20.6,21.7l-20.6-21.7c-4.4-4.6-4.4-12,0-16.6
			C770.9,1294.1,773.7,1293,776.5,1293L776.5,1293z"/>
	</g>
</g>
<g transform="translate(0,-952.36218)">
	<path d="M404.6,1329.9c-2.6,0-5.1,1-7,3.1c-3.9,4.1-3.9,10.6,0,14.7l15.5,16.3c0.4,0.4,1,0.4,1.4,0l0,0
		c5.2-5.4,10.4-10.9,15.5-16.3c3.9-4.1,3.9-10.6,0-14.7s-10.2-4.1-14.1,0l-2.2,2.3l-2.2-2.3C409.7,1330.9,407.2,1329.9,404.6,1329.9
		z M404.6,1331.8c2,0,4.1,0.8,5.6,2.5l2.9,3c0.4,0.4,1,0.4,1.4,0l0,0l2.9-3c3.1-3.3,8.1-3.3,11.2,0s3.1,8.7,0,12
		c-4.9,5.2-9.9,10.4-14.8,15.6l-14.8-15.6c-3.1-3.3-3.1-8.7,0-12C400.6,1332.7,402.6,1331.8,404.6,1331.8L404.6,1331.8z"/>
</g>
<path d="M90.2,523.2c0.6,0.1,1.3,0.4,1.8,0.8l1.4,1.2c1.3,1.1,1.5,2.7,0.7,3.6c-0.8,0.9-2.4,1-3.7-0.1l-1.4-1.2
	c-1.3-1.1-1.5-2.8-0.7-3.6C88.8,523.4,89.5,523.2,90.2,523.2z M94.1,516.7c0.7,0,1.4,0.2,2,0.7l2.3,1.9c1.2,1,1.4,2.8,0.3,4
	c-1,1.2-2.8,1.3-4,0.3l-2.3-1.9c-1.2-1-1.4-2.9-0.3-4C92.7,517.1,93.4,516.8,94.1,516.7z M98.2,510.1c0.7,0,1.4,0.2,2,0.7l3.1,2.7
	c1.2,1,1.4,2.8,0.3,4c-1,1.2-2.8,1.4-4,0.3c-1-0.9-2.1-1.8-3.1-2.7c-1.2-1-1.4-2.9-0.3-4C96.8,510.5,97.5,510.1,98.2,510.1z
	 M103.3,504.2c0.7,0,1.4,0.2,2,0.7l3.1,2.7c1.2,1,1.4,2.8,0.3,4c-1,1.2-2.8,1.4-4,0.3l-3.1-2.7c-1.2-1-1.4-2.9-0.3-4
	C101.8,504.6,102.6,504.3,103.3,504.2z M103,502.3c-1.2,0.1-2.5,0.7-3.3,1.7c-1,1.2-1.3,2.8-1,4.2c-1.5-0.1-3,0.5-4,1.7
	c-1.2,1.4-1.4,3.3-0.8,4.9c-1.2,0.1-2.5,0.7-3.3,1.7c-1.2,1.4-1.4,3.2-0.9,4.8c-1.1,0-2.2,0.5-2.9,1.4c-1.5,1.7-1.1,4.3,0.5,6
	l-9.2,8.4c-1.1,0.9,0.4,2.5,1.3,1.5l9.4-8.6l0.3,0.2c2,1.7,4.9,1.8,6.5-0.1c0.9-1.1,1.1-2.5,0.8-3.8c1.4,0.1,2.9-0.5,3.9-1.7
	s1.4-2.8,1-4.2c1.5,0.1,3-0.5,4-1.7s1.3-2.8,1-4.2c1.5,0.1,3-0.5,4-1.7c1.7-2,1.5-5.1-0.5-6.9l-3.1-2.7
	C105.5,502.6,104.3,502.2,103,502.3z"/>
<path d="M128.3,498.4l3,0.1c1.1,0,1.8,0.4,2.2,1.1l1.1,2.1l-4-0.2L128.3,498.4z M121.3,494.1c1,0,1.9,0.6,2.6,1.6l4.1,5.8l-7.8-0.3
	l0.8-0.6c0.8-0.6,0.3-1.8-0.6-1.8c-0.2,0-0.4,0.1-0.6,0.2l-2.6,2.1l-3.6,0.2c-1.9,0.1-3.2-0.8-3.7-1.6c-0.5-1-0.4-1.1,0.4-1.3
	c3.5-0.9,5.6-1.5,9-3.6C120,494.3,120.7,494.1,121.3,494.1z M118.3,493c-3.4,2.1-5,2.6-8.8,3.5c-0.9,0.2-1.6,1-1.8,1.8
	c-0.2,0.8,0.1,1.7,0.6,2.4c0.9,1.5,2.9,2.7,5.5,2.6l3.8-0.2l18.4,0.8c1.6,0.1,2.5,1.2,2.8,2.5c0.3,1.2,0.4,2.7-0.7,2.8l-14.3,1.8
	c-1.4,0.1-1.1,2.2,0.3,2l14.2-1.8c1.6,0,2.5,1.5,2.7,2.6c0.2,1,0,2.4-1.4,2.7l-12.2,2.5c-1.4,0.2-1,2.3,0.4,2l12.2-2.5
	c1-0.2,2.1,0.7,2.3,1.7c0.3,2.1-0.4,2.9-1.8,3.4l-12.6,4.2c-1.3,0.4-0.6,2.3,0.6,1.9l12.6-4.3c0.9-0.3,1.4-0.2,1.9,0.1
	c0.4,0.3,0.8,0.7,1,1.3c0.3,1.2,0,2.6-1.3,3.2c-4.8,2.3-17,7.4-17,7.4l-15.1,4.8c-0.1,0-0.3,0.1-0.4,0.2L95.3,556
	c-1,0.9,0.4,2.4,1.3,1.5l14.8-13.5l15-4.8c0,0,12.2-5.1,17.2-7.4c0.4-0.2,0.7-0.4,0.9-0.6l11,7.1c1.1,0.7,2.2-1,1.1-1.7l-10.9-7
	c0.5-1.1,0.6-2.3,0.2-3.3c-0.5-1.4-1.2-2.1-2.3-2.6c0.9-1.3,1-2.8,0.6-4.1c-0.4-1.1-1.1-2-2.1-2.6c0.8-1,1.1-2.4,0.9-3.6
	c-0.3-1.4-1.2-2.7-2.7-3.5c0.7-1.2,0.8-2.7,0.5-3.9c-0.4-1.7-1.7-3.4-3.7-3.9l-1.7-3.2c-0.4-0.7-0.9-1.3-1.5-1.7
	c-0.7-0.4-1.5-0.5-2.4-0.6l-4.5-0.2l0,0l-1.3-1.8c-0.7-1-1.6-2.2-3.5-2.4C120.1,491.9,119.1,492.5,118.3,493z"/>
<path d="M120.9,546.3l8.5,2.6l13.5,8.6c1.2,0.9,2.3-1,1.1-1.7l-13.7-8.8l-8.8-2.7C120.4,544,119.9,545.9,120.9,546.3z"/>
<g transform="translate(0,-952.36218)">
	<path d="M159.3,1443.4c-2.6,0-5.1,1-7,3.1c-3.9,4.1-3.9,10.6,0,14.7l15.5,16.3c0.4,0.4,1,0.4,1.4,0l0,0
		c5.2-5.4,10.4-10.9,15.5-16.3c3.9-4.1,3.9-10.6,0-14.7s-10.2-4.1-14.1,0l-2.2,2.3l-2.2-2.3C164.5,1444.4,161.9,1443.4,159.3,1443.4
		z M159.3,1445.3c2,0,4.1,0.8,5.6,2.5l2.9,3c0.4,0.4,1,0.4,1.4,0l0,0l2.9-3c3.1-3.3,8.1-3.3,11.2,0c3.1,3.3,3.1,8.7,0,12
		c-4.9,5.2-9.9,10.4-14.8,15.6l-14.8-15.6c-3.1-3.3-3.1-8.7,0-12C155.3,1446.2,157.3,1445.3,159.3,1445.3L159.3,1445.3z"/>
</g>
<g>
	<g>
		<g>
			<g>
				<path d="M442.9,314.9h-93.1c-10.2,0-18.5-8.3-18.5-18.5c0-0.6,0.4-1,1-1h128c0.6,0,1,0.4,1,1C461.3,306.6,453,314.9,442.9,314.9
					z M333.4,297.5c0.5,8.6,7.7,15.5,16.4,15.5h93.1c8.7,0,15.9-6.9,16.4-15.5H333.4z"/>
			</g>
			<g>
				<path d="M450.7,297.5h-6c-0.6,0-1-0.4-1-1v-68h-19c-0.6,0-1-0.4-1-1s0.4-1,1-1h20c0.6,0,1,0.4,1,1v68h4v-69.7
					c0-1.8-1.5-3.3-3.3-3.3h-14.7c-0.6,0-1-0.4-1-1s0.4-1,1-1h14.7c2.9,0,5.3,2.4,5.3,5.3v70.7C451.7,297,451.2,297.5,450.7,297.5z"
					/>
			</g>
			<g>
				<path d="M456.7,297.5h-6c-0.6,0-1-0.4-1-1s0.4-1,1-1h6c0.6,0,1,0.4,1,1S457.2,297.5,456.7,297.5z"/>
			</g>
			<g>
				<path d="M348,297.5h-6c-0.6,0-1-0.4-1-1v-70.7c0-2.9,2.4-5.3,5.3-5.3h24.4c0.6,0,1,0.4,1,1s-0.4,1-1,1h-24.4
					c-1.8,0-3.3,1.5-3.3,3.3v69.7h4v-68c0-0.6,0.4-1,1-1h15.5c0.6,0,1,0.4,1,1s-0.4,1-1,1H349v68C349,297,348.6,297.5,348,297.5z"/>
			</g>
		</g>
		<g>
			<path d="M410,306.2h-27.3c-0.3,0-0.7-0.2-0.8-0.5l-5.7-8.7c-0.2-0.3-0.2-0.7,0-1s0.5-0.5,0.9-0.5h38.7c0.4,0,0.7,0.2,0.9,0.5
				s0.2,0.7,0,1l-5.7,8.7C410.7,306,410.3,306.2,410,306.2z M383.2,304.2h26.2l4.4-6.7h-35L383.2,304.2z"/>
		</g>
	</g>
	<g>
		<g>
			<g>
				<path d="M389.6,258.9c-0.3,0-0.6-0.1-0.8-0.3l-26.1-30.1c-0.2-0.2-0.3-0.5-0.2-0.7c0-0.3,0.1-0.5,0.3-0.7l47.5-41.2
					c0.2-0.2,0.5-0.3,0.7-0.2c0.3,0,0.5,0.1,0.7,0.3l26.1,30.1c0.4,0.4,0.3,1-0.1,1.4l-47.5,41.2C390,258.8,389.8,258.9,389.6,258.9
					z M364.9,227.8l24.8,28.6l46-39.9L410.9,188L364.9,227.8z"/>
			</g>
			<g>
				<path d="M363.5,228.7c-0.5,0-1-0.4-1-1s0.4-1,1-1l40.1-0.8l6.5-39.6c0.1-0.5,0.6-0.9,1.1-0.8c0.5,0.1,0.9,0.6,0.8,1.1l-6.6,40.4
					c-0.1,0.5-0.5,0.8-1,0.8L363.5,228.7L363.5,228.7z"/>
			</g>
			<g>
				<path d="M437.1,217.7L437.1,217.7l-30.7-2.2c-0.6,0-1-0.5-0.9-1.1c0-0.6,0.5-1,1.1-0.9l30.6,2.2c0.6,0,1,0.5,0.9,1.1
					C438.1,217.3,437.6,217.7,437.1,217.7z"/>
			</g>
			<g>
				<path d="M389.6,258.9C389.6,258.9,389.5,258.9,389.6,258.9c-0.6,0-1-0.5-1-1.1l2.2-30.6c0-0.6,0.5-1,1.1-0.9
					c0.6,0,1,0.5,0.9,1.1l-2.2,30.6C390.5,258.4,390.1,258.9,389.6,258.9z"/>
			</g>
		</g>
		<g>
			<g>
				<path d="M362.7,269.4c-0.3,0-0.6-0.1-0.8-0.3c-0.4-0.4-0.3-1,0.1-1.4l13.4-11.6c0.4-0.4,1-0.3,1.4,0.1c0.4,0.4,0.3,1-0.1,1.4
					l-13.4,11.6C363.2,269.3,362.9,269.4,362.7,269.4z"/>
			</g>
			<g>
				<path d="M355.6,248.3c-0.3,0-0.6-0.1-0.8-0.3c-0.4-0.4-0.3-1,0.1-1.4l7.1-6.1c0.4-0.4,1-0.3,1.4,0.1c0.4,0.4,0.3,1-0.1,1.4
					l-7.1,6.1C356,248.2,355.8,248.3,355.6,248.3z"/>
			</g>
			<g>
				<path d="M359,258.9c-0.3,0-0.6-0.1-0.8-0.3c-0.4-0.4-0.3-1,0.1-1.4l10.3-8.9c0.4-0.4,1-0.3,1.4,0.1s0.3,1-0.1,1.4l-10.3,8.9
					C359.5,258.9,359.3,258.9,359,258.9z"/>
			</g>
		</g>
	</g>
</g>
</svg>
