{
  "admin": {
      "username": "admin",
      "password": "PASSWORD"
  },
  "users": [
    {
      "username": "argo",
      "password": "PASSWORD"
    }
  ],
  "databaseTunnels": {
     "itwiki_p":  13306,
     "frwiki_p":  13307,
     "dewiki_p":  13308,
     "enwiki_p":  13309,
     "rmwiki_p":  13310,
     "alswiki_p": 13311
  }
}
