{
    "admin": {
        "username": "admin",
        "password": "PASSWORD"
    },
    "users": [
        {
            "username": "argo",
            "password": "PASSWORD"
        }
    ],
    "languageTunnels": {
        "itwiki": 13306,
        "frwiki": 13307,
        "dewiki": 13308,
        "enwiki": 13309,
        "rmwiki": 13310,
        "alswiki": 13311
    }
}
