{
    "global": [
        "steward",
        "sysadmin",
        "staff",
        "global-interface-editor",
        "global-sysop",
        "new-wikis-importer",
        "ombuds"
    ],
    "special": {
        "metawiki": ["steward", "centralnoticeadmin", "wmf-officeit", "wmf-supportsafety"],
        "wikifunctionswiki": ["wikifunctions-staff"],
        "wikidatawiki": ["wikidata-staff"]
    },
    "local": [
        "interface-admin"
    ]
}
