module gitlab.wikimedia.org/repos/sre/mercurius

go 1.22.4

require (
	gerrit.wikimedia.org/r/operations/software/prometheus-rdkafka-exporter v0.0.0-20230728141441-717dc0cc1c9f
	github.com/beorn7/perks v1.0.1
	github.com/cenkalti/backoff/v4 v4.3.0
	github.com/cespare/xxhash/v2 v2.2.0
	github.com/confluentinc/confluent-kafka-go v1.8.2
	github.com/davecgh/go-spew v1.1.2-0.20180830191138-d8f796af33cc
	github.com/fsnotify/fsnotify v1.7.0
	github.com/hashicorp/hcl v1.0.0
	github.com/inconshreveable/mousetrap v1.1.0
	github.com/magiconair/properties v1.8.7
	github.com/mattn/go-colorable v0.1.13
	github.com/mattn/go-isatty v0.0.20
	github.com/mitchellh/mapstructure v1.5.0
	github.com/pelletier/go-toml/v2 v2.2.2
	github.com/pkg/errors v0.9.1
	github.com/pmezard/go-difflib v1.0.1-0.20181226105442-5d4384ee4fb2
	github.com/prometheus/client_golang v1.19.1
	github.com/prometheus/client_model v0.5.0
	github.com/prometheus/common v0.48.0
	github.com/prometheus/procfs v0.12.0
	github.com/rs/zerolog v1.33.0
	github.com/sagikazarmark/locafero v0.4.0
	github.com/sagikazarmark/slog-shim v0.1.0
	github.com/sourcegraph/conc v0.3.0
	github.com/spf13/afero v1.11.0
	github.com/spf13/cast v1.6.0
	github.com/spf13/cobra v1.8.1
	github.com/spf13/pflag v1.0.5
	github.com/spf13/viper v1.19.0
	github.com/stretchr/testify v1.9.0
	github.com/subosito/gotenv v1.6.0
	go.elastic.co/ecszerolog v0.2.0
	go.uber.org/atomic v1.9.0
	go.uber.org/multierr v1.9.0
	golang.org/x/exp v0.0.0-20230905200255-921286631fa9
	golang.org/x/sys v0.18.0
	golang.org/x/text v0.14.0
	google.golang.org/protobuf v1.33.0
	gopkg.in/ini.v1 v1.67.0
	gopkg.in/yaml.v3 v3.0.1
)
