{
  "description": "IngressRule represents the rules mapping the paths under a specified host to the related backend services. Incoming requests are first evaluated for a host match, then routed to the backend associated with the matching IngressRuleValue.",
  "properties": {
    "host": {
      "description": "Host is the fully qualified domain name of a network host, as defined by RFC 3986. Note the following deviations from the \"host\" part of the URI as defined in the RFC: 1. IPs are not allowed. Currently an IngressRuleValue can only apply to the\n\t  IP in the Spec of the parent Ingress.\n2. The `:` delimiter is not respected because ports are not allowed.\n\t  Currently the port of an Ingress is implicitly :80 for http and\n\t  :443 for https.\nBoth these may change in the future. Incoming requests are matched against the host before the IngressRuleValue. If the host is unspecified, the Ingress routes all traffic based on the specified IngressRuleValue.",
      "type": [
        "string",
        "null"
      ]
    },
    "http": {
      "$ref": "https://raw.githubusercontent.com/yannh/kubernetes-json-schema/master/v1.16.15/_definitions.json#/definitions/io.k8s.api.networking.v1beta1.HTTPIngressRuleValue"
    }
  },
  "type": "object",
  "$schema": "http://json-schema.org/schema#"
}