module gitlab.wikimedia.org/repos/sre/gonduit

require (
	github.com/gin-gonic/gin v1.4.0
	github.com/karlseguin/typed v1.1.7
	github.com/onsi/ginkgo v1.8.0
	github.com/onsi/gomega v1.5.0
	github.com/stretchr/testify v1.3.0
)

go 1.13
