lang	features	LR	Linear SVM	RF
de	language agnostic	0.572 ± 0.0	0.569 ± 0.002	0.672 ± 0.004
de	readability	0.54 ± 0.001	0.539 ± 0.002	0.558 ± 0.056
de	readability_custom	0.683 ± 0.002	0.678 ± 0.008	0.592 ± 0.034
de_klexikon	language agnostic	0.728 ± 0.0	0.731 ± 0.003	0.713 ± 0.006
de_klexikon	readability	0.514 ± 0.001	0.512 ± 0.003	0.617 ± 0.095
de_klexikon	readability_custom	0.91 ± 0.0	0.907 ± 0.006	0.646 ± 0.015
de_retokenized	language agnostic	0.572 ± 0.0	0.569 ± 0.002	0.672 ± 0.004
de_retokenized	readability	0.54 ± 0.001	0.539 ± 0.002	0.558 ± 0.056
de_retokenized	readability_custom	0.683 ± 0.002	0.678 ± 0.008	0.592 ± 0.034
en	language agnostic	0.682 ± 0.0	0.676 ± 0.001	0.787 ± 0.004
en	readability	0.777 ± 0.0	0.783 ± 0.008	0.764 ± 0.066
en	readability_custom	0.777 ± 0.0	0.78 ± 0.004	0.763 ± 0.066
es	language agnostic	0.655 ± 0.0	0.649 ± 0.002	0.715 ± 0.001
es	readability	0.5 ± 0.0	0.5 ± 0.0	0.5 ± 0.0
es	readability_custom	0.662 ± 0.0	0.664 ± 0.004	0.639 ± 0.006
fr	language agnostic	0.613 ± 0.0	0.606 ± 0.001	0.68 ± 0.002
fr	readability	0.675 ± 0.0	0.672 ± 0.005	0.639 ± 0.027
fr	readability_custom	0.648 ± 0.0	0.65 ± 0.004	0.643 ± 0.032
it	language agnostic	0.687 ± 0.0	0.689 ± 0.003	0.754 ± 0.003
it	readability	0.5 ± 0.0	0.5 ± 0.0	0.5 ± 0.0
it	readability_custom	0.719 ± 0.0	0.719 ± 0.001	0.646 ± 0.004
ru	language agnostic	0.543 ± 0.0	0.509 ± 0.004	0.658 ± 0.012
ru	readability	0.516 ± 0.0	0.516 ± 0.0	0.365 ± 0.021
ru	readability_custom	0.585 ± 0.0	0.587 ± 0.003	0.549 ± 0.015
