classifier	features	paired
LR	avg_sent_length_entity_types	0.668
LR	avg_sent_length_mention_types	0.665
LR	avg_sent_length_tokens_lang_agn	0.668
LR	doc_type_token_ratio_entity	0.582
LR	doc_type_token_ratio_mention	0.588
LR	flesch_reading_ease	0.718
LR	language agnostic	0.663
LR	readability	0.718
LR	readability + language agnostic	0.738
LR	sent_type_token_ratio_entity	0.63
LR	sent_type_token_ratio_mention	0.66
Linear SVM	avg_sent_length_entity_types	0.668
Linear SVM	avg_sent_length_mention_types	0.666
Linear SVM	avg_sent_length_tokens_lang_agn	0.668
Linear SVM	doc_type_token_ratio_entity	0.582
Linear SVM	doc_type_token_ratio_mention	0.588
Linear SVM	flesch_reading_ease	0.719
Linear SVM	language agnostic	0.662
Linear SVM	readability	0.719
Linear SVM	readability + language agnostic	0.739
Linear SVM	sent_type_token_ratio_entity	0.63
Linear SVM	sent_type_token_ratio_mention	0.66
RF	avg_sent_length_entity_types	0.698
RF	avg_sent_length_mention_types	0.696
RF	avg_sent_length_tokens_lang_agn	0.693
RF	doc_type_token_ratio_entity	0.672
RF	doc_type_token_ratio_mention	0.671
RF	flesch_reading_ease	0.771
RF	language agnostic	0.702
RF	readability	0.771
RF	readability + language agnostic	0.736
RF	sent_type_token_ratio_entity	0.686
RF	sent_type_token_ratio_mention	0.69
