index	ru	es	fr	en	de	it
flesch_reading_ease	0.755	0.842	0.845	0.922	0.801	0.839
avg_sent_length_tokens_lang_agn	0.632	0.735	0.714	0.784	0.582	0.794
avg_sent_length_entity_types	0.623	0.726	0.713	0.776	0.559	0.798
avg_sent_length_mention_types	0.613	0.734	0.712	0.783	0.562	0.791
sent_type_token_ratio_entity	0.16	0.224	0.257	0.254	0.207	0.183
sent_type_token_ratio_mention	0.094	0.165	0.174	0.193	0.156	0.141
doc_type_token_ratio_entity	0.245	0.301	0.394	0.301	0.445	0.251
doc_type_token_ratio_mention	0.198	0.301	0.38	0.285	0.531	0.256
