index	es	fr	en	de	it	de_retokenized	ru
flesch_reading_ease	0.759	0.841	0.922	0.835	0.643	0.831	0.734
avg_sent_length_tokens_lang_agn	0.744	0.715	0.789	0.731	0.805	0.731	0.606
avg_sent_length_entity_types	0.736	0.714	0.781	0.682	0.807	0.694	0.617
avg_sent_length_mention_types	0.743	0.714	0.789	0.707	0.802	0.711	0.628
sent_type_token_ratio_entity	0.658	0.572	0.66	0.727	0.633	0.719	0.574
sent_type_token_ratio_mention	0.629	0.58	0.654	0.636	0.61	0.64	0.543
doc_type_token_ratio_entity	0.665	0.569	0.685	0.508	0.694	0.5	0.596
doc_type_token_ratio_mention	0.67	0.572	0.702	0.587	0.686	0.579	0.681
