classifier	features	paired
LR	avg_sent_length_entity_types	0.655
LR	avg_sent_length_mention_types	0.654
LR	avg_sent_length_tokens_lang_agn	0.654
LR	doc_type_token_ratio_entity	0.574
LR	doc_type_token_ratio_mention	0.576
LR	flesch_reading_ease	0.717
LR	language agnostic	0.657
LR	readability	0.717
LR	readability + language agnostic	0.738
LR	sent_type_token_ratio_entity	0.582
LR	sent_type_token_ratio_mention	0.59
Linear SVM	avg_sent_length_entity_types	0.654
Linear SVM	avg_sent_length_mention_types	0.654
Linear SVM	avg_sent_length_tokens_lang_agn	0.655
Linear SVM	doc_type_token_ratio_entity	0.575
Linear SVM	doc_type_token_ratio_mention	0.577
Linear SVM	flesch_reading_ease	0.718
Linear SVM	language agnostic	0.656
Linear SVM	readability	0.717
Linear SVM	readability + language agnostic	0.738
Linear SVM	sent_type_token_ratio_entity	0.587
Linear SVM	sent_type_token_ratio_mention	0.596
RF	avg_sent_length_entity_types	0.685
RF	avg_sent_length_mention_types	0.687
RF	avg_sent_length_tokens_lang_agn	0.687
RF	doc_type_token_ratio_entity	0.644
RF	doc_type_token_ratio_mention	0.644
RF	flesch_reading_ease	0.77
RF	language agnostic	0.692
RF	readability	0.771
RF	readability + language agnostic	0.741
RF	sent_type_token_ratio_entity	0.641
RF	sent_type_token_ratio_mention	0.619
