Code	Name in English	Category	Main Page	Size
mis (Uncoded languages)	Bolak	Bolak	Main Page/Bolak	9
mis (Uncoded languages)	Chono	Chono	Main Page/Chono	2
mis (Uncoded languages)	Tutonish	Tutonish	Main Page/Tutonish	10
mul (Multiple languages)	N/A	Mul	N/A	64
und (Undetermined)	N/A	Und	N/A	1
zxx (No linguistic content)	N/A	Zxx	N/A	35
ace	Bahsa Acèh	Bahsa Acèh	Main Page/Aceh	10
aat	Arvanitika	aat Αρbε̰ρίσ̈τε	Main Page/Αρbε̰ρίσ̈τε	2
ab	Abkhaz	ab Аҧсуа	Main Page/Аҧсуа	20
ady	Adyghe	ady Адыгэбзэ	Main Page/Адыгэбзэ	38
af	Afrikaans	af Afrikaans	Main Page/Afrikaans	254
akk	Akkadian	akk 𒀝𒅗𒁺𒌑	Main Page/𒀝𒂵𒌈	6
an	Aragonese	Aragonés	Main Page/Aragonés	43
arp	Arapaho	Hinónoʼeitíít	Main Page/Hinónoʼeitíít	3
arq	Algerian arabic	Algerian	Main Page/Algerian	3
ast	Asturian	Asturianu	Main Page/Asturianu	173
ave	Avestan	Avestan	Main Page/Avestan	2
azb	South Azerbaijani	South Azerbaijani	Main Page/South Azerbaijani	82
ba	Bashkir	Башҡортса	Main Page/Башҡортса	"2,299"
ban	Balinese	ᬪᬵᬱᬩᬮᬶ	Main Page/ᬪᬵᬱᬩᬮᬶ	36
bcl	Central Bikol	Bikol Sentral	Main Page/Bikol Sentral	565
bjn	Banjarese	بهاس بنجر	Main Page/Banjar	3
bm	Bambara	Bamanankan	Main Page/Bamanankan	4
bo	Tibetan	Tibetan	Main Page/བོད་སྐད་	111
brx	Bodo	बड़ो	Main Page/बड़ो	1
cdo	Eastern Min	Mìng-dĕ̤ng-ngṳ̄/閩東語	Main Page/Mìng-dĕ̤ng-ngṳ̄	117
chr	Cherokee	ᏣᎳᎩ	Main Page/ᏣᎳᎩ	116
chu	Church Slavonic	Слове́нскїй	Main Page/Славе́нскїй	242
cnr	Montenegrin	Crnogorski	Main Page/Crnogorski	5
co	Corsican	Corsu	Main Page/Corsu	2
cop	Coptic	Coptic	Main Page/Ϯⲁⲥⲡⲓ ̀ⲛⲣⲉⲙ̀ⲛⲬⲏⲙⲓ	30
cpx	Puxian Min	Pó-sing-gṳ̂	Main Page/Pó-sing-gṳ̂	12
csb	Kashubian	Kaszëbsczi	Main Page/Kaszëbsczi	16
cu	Old Church Slavonic	Слове́нскїй	Main Page/Словѣньскъ	242
cv	Chuvash	Чăваш	Main Page/Чăваш	357
de	German	Deutsch	Main Page/Deutsch	132
diq	Zazaki	Zazaki	Main Page/Zazaki	391
dlm	Dalmatian	Dalmot	Main Page/Dalmot	8
dsb	Lower Sorbian	Dolnoserbšćina	Main Page/Dolnoserbšćina	43
egy	Ancient Egyptian	Ancient Egyptian	Main Page/Ancient Egyptian	35
ext	Extremaduran	Estremeñu	Main Page/Estremeñu	3
fr	French	Français	Main Page/Français	54
fy	West Frisian	Frysk	Main Page/Frysk	62
ga	Irish	Gaeilge	Main Page/Gaeilge	226
gag	Gagauz	Gagauz	Main Page/Gagauz	192
gd	Scottish Gaelic	Gàidhlig	Main Page/Gàidhlig	46
got	Gothic	𐌲𐌿𐍄𐌹𐍃𐌺	Main Page/𐌲𐌿𐍄𐌹𐍃𐌺	5
grc	Ancient Greek	Ancient Greek	Main Page/Ἀρχαία ἑλληνική	4
haw	Hawaiian	ʻŌlelo Hawaiʻi	Main Page/ʻŌlelo Hawaiʻi	170
hsb	Upper Sorbian	Upper Sorbian	Main Page/Hornjoserbšćina	243
ht	Haitian Creole	Kreyòl Ayisyen	Main Page/Kreyòl Ayisyen[2]	4
ia	Interlingua	Interlingua	Main Page/Interlingua	257
io	Ido	id Ido	Main Page/Ido	"1,210"
ist	Istriot	Istriot	Main Page/Istriot	220
iu	Inuktitut	Inuktitut	Main Page/Inuktitut	6
jv	Javanese	Jv Basa Jawa	Main Page/Basa Jawa	703
ka	Georgian	Georgian	Main Page/ქართული	"6,757"
kk	Kazakh	Kazakh	Main Page/Қазақша	135
km	Khmer (Cambodian)	ភាសាខ្មែរ	Main Page/ភាសាខ្មែរ	632
koi	Komi-Permyak	Komi-Permyak	Main Page/Перем Коми	5
krl	Karelian	Karjala	Main Page/Karjala	2
ku	Kurdish	Kurdî	Main Page/Kurdî	"5,912"
kw	Cornish	Kernewek	Main Page/Kernewek	22
ky	Kyrgyz	Кыргызча	Main Page/Кыргызча	153
lad	Judaeo-Spanish (Ladino)	Ladino	Main Page/Ladino	10
lb	Luxembourgish	Lëtzebuergesch	Main Page/Lëtzebuergesch	8
ldn	Láadan	Láadan	Main Page/Láadan	9
lg	Luganda	Luganda	Main Page/Luganda	3
liv	Livonian	Līvõ kēļ	Main Page/Līvõ kēļ	5
lld	Ladin	Ladin	Main Page/Ladin	987
lmo	Lombard	Lumbaart	Main Page/Lumbaart	706
ln	Lingala	Lingála	Main Page/Lingála	4
lo	Lao	ລາວ	Main Page/ລາວ	154
lra	Lara	Lara language	Main Page/Laraʼ	24
lv	Latvian	Latvian	Main Page/Latviešu	101
lzh	Literary Chinese	Literary Chinese	Main_Page/lzh	39
mas	Maasai	Ɔl Maa	Main Page/Ɔl Maa	2
mdf	Moksha	Мокшень	Main Page/Мокшень	621
mg	Malagasy	Malagasy	Main Page/Malagasy	11
mhr	Meadow Mari	Meadow Mari	Main Page/Олык марий	77
mi	Māori	Māori	Main Page/Māori	69
mnc	Manchu	ᠮᠠᠨᠵᡠ ᡤᡳᠰᡠᠨ	Main Page/ᠮᠠᠨᠵᡠ ᡤᡳᠰᡠᠨ	36
mnp	Northern Min	Mâing-bă̤-ngṳ̌	Main Page/Mâing-bă̤-ngṳ̌	18
mrj	Hill Mari	Hill Mari	Main Page/Кырык мары	222
ms	Bahasa Melayu	Bahasa Melayu	Main Page/Bahasa Melayu	402
mt	Maltese	Malti	Main Page/Malti	44
mwl	Mirandese	Mirandés	Main Page/Mirandés	125
my	Burmese	မြန်မာဘာသာ	Main Page/မြန်မာဘာသာ	"2,421"
blk	Pa'O	ပအိုဝ်ႏဘာႏသာႏ	Main Page/ပအိုဝ်ႏဘာႏသာႏ	2
myv	Erzya	Эрзянь	Main Page/Эрзянь	660
mzn	Mazandarani	Mazandarani	Main Page/مازرونی	3
nah	Nahuatl	Nahuatl	Main Page/Nāhuatl	8
nds	Low German	Nds	Main Page/Plattdüütsch	"1,596"
ne	Nepali	नेपाली	Main Page/नेपाली	162
yrl	Nheengatu	Nheengatú	Main Page/Nheengatú	4
ng	Ndonga	Ndonga	Main Page/Ndonga	3
nod	Northern Thai	ᨣᩤᩴᨾᩮᩬᩥᨦ	Main Page/ᨣᩤᩴᨾᩮᩬᩥᨦ	9
non	Old Norse	Norrœnt	Main Page/Norrœnt	5
nrn	Norn	Norn	Main Page/Norn	2
nv	Navajo	Diné Bizaad	Main Page/Diné Bizaad	2
oc	Occitan	Occitan	Main Page/Occitan	156
olo	Livvi-Karelian	Livvikarjalan	Main Page/Livvikarjalan	13
ota	Ottoman	Ottoman	Main Page/عثمانلوجه	83
otk	Old Turkic	𐱅𐰇𐰼𐰜𐰲𐰀	Main Page/𐱅𐰇𐰼𐰜𐰲𐰀	2
pau	Palauan	Palau	Main Page/Palau	2
pcd	Picard	Picard	Main Page/Picard	39
pi	Pali	Pali	Main Page/Pāḷi	87
pl	Polish	Polski[3]	pl:Strona główna	"14,282"
pnb	Punjabi (Western Punjabi in Perso-Arabic (Shahmukhi) script)	پنجابی	Main Page/پنجابی	"1,194"
pnt	Pontic Greek	Pontic	Main Page/Ποντιακά	11
pox	Polabian	Wenska rec	Main Page/Wenska rec	2
ps	Pashto	پښتو	لومړی مخ	212
pwn	pinayuanan	pinayuanan	Main Page/pinayuanan	8
qu	Quechua	Runa Simi	Main Page/Runa Simi	18
rml	Baltic Romani	Романы	Main Page/Романы	3
ruo	Istro-Romanian	Rumârește	Main Page/Rumârește	23
rup	Aromanian	Aromanian	Main Page/Armâneascâ	95
sc	Sardinian	Sardu	Main Page/Sardu	22
se	Northern Sami	Davvisámegiella	Main Page/Davvisámegiella	"1,422"
see	Seneca	Onödowága	Main Page/Onödowága	5
si	Sinhala	සිංහල	Main Page/සිංහල	"1,156"
sia	Akkala Sami	Akkala Sami	Main Page/Akkala Sami	33
sjd	Kildin Sami	Кӣллт са̄мь кӣлл	Main Page/Кӣллт са̄мь кӣлл	57
sn	Shona	ChiShona	Main Page/ChiShona	5
sq	Albanian	Sq Shqip	Main Page/Shqip	318
su	Sundanese	Sunda	Main Page/Sunda	9
suk	Sukuma	Sukuma	Main Page/Sukuma	3
sw	Swahili	Kiswahili	Main Page/Kiswahili	46
tet	Tetum	Tetun	Main Page/Tetun	2
tg	Tajik	Тоҷикӣ	Main Page/Тоҷикӣ	63
tl	Tagalog	Tagalog	Main Page/Tagalog	164
tok	Toki Pona	toki pona	Main Page/toki pona	235
tpn	Tupi	Abá nhe'enga	Main Page/Abá nhe'enga	6
tr	Turkmen	Түрқмен	Main Page/Түрқменчә	99
tt	Tatar	Tatar	Main Page/Татарча	962
txg	Tangut	𗼇𗟲	Main Page/𗼇𗟲	49
tyv	Tyvan	Тыва дыл	Main Page/Тыва дыл	163
udm	Udmurt	Udmurt	Main Page/Удмурт	317
ur	Urdu	Urdu	Main Page/اردو	"12,305"
uz	Uzbek	O‘zbek	Main Page/O‘zbek	"3,725"
vep	Veps	Vepsän kel'	Main Page/Vepsän kel'	4
vo	Volapük	Volapük	Main Page/Volapük	760
wym	Wymysorys	Wymysöryś	Main Page/Wymysöryś	71
xh	Xhosa	IsiXhosa	Main Page/IsiXhosa	27
xmf	Mingrelian	Mingrelian	Main Page/მარგალური	"3,543"
yrk	Nenets	Ненэцяʼ	Main Page/Ненэцяʼ	4
yol	Yola	Yola	Main Page/Yola	20
yue	Cantonese	粵文	Main Page/粵文	21
zkt	Khitan	Khitan	Main Page/Khitan	11
zu	Zulu	IsiZulu	Main Page/IsiZulu	34