prefix	project	language_code	language_name
Wb/aa	Wikibooks	aa	Afar
Wy/aa	Wikivoyage	aa	Afar
Wt/aa	Wiktionary	aa	Afar
Wq/aa	Wikiquote	aa	Afar
Wp/aa	Wikipedia	aa	Afar
Wp/aaa	Wikipedia	aaa	Ghotuo
Wp/aae	Wikipedia	aae	Arbëreshë Albanian
Wp/aaf	Wikipedia	aaf	Aranadan
Ws/aat	Wikisource	aat	Arvanitika Albanian
Wp/aat	Wikipedia	aat	Arvanitika Albanian
Wt/ab	Wiktionary	ab	Abkhazian
Ws/ab	Wikisource	ab	Abkhazian
Wp/ab	Wikipedia	ab	Abkhazian
Wn/ab	Wikinews	ab	Abkhazian
Wb/ab	Wikibooks	ab	Abkhazian
Wp/abc	Wikipedia	abc	Ambala Ayta
Wp/abl	Wikipedia	abl	Lampung Nyo
Wp/abq	Wikipedia	abq	Abaza
Wp/abr	Wikipedia	abr	Abron
Wp/abs	Wikipedia	abs	Ambonese Malay
Wp/abv	Wikipedia	abv	Baharna Arabic
Wt/ace	Wiktionary	ace	Acehnese
Wy/ace	Wikivoyage	ace	Acehnese
Ws/ace	Wikisource	ace	Acehnese
Wb/ace	Wikibooks	ace	Acehnese
Wp/ace	Wikipedia	ace	Acehnese
Wn/ace	Wikinews	ace	Acehnese
Wq/ace	Wikiquote	ace	Acehnese
Wp/acf	Wikipedia	acf	Saint Lucian Creole French
Wp/ach	Wikipedia	ach	Acoli
Wp/acm	Wikipedia	acm	Mesopotamian Arabic
Wt/acm	Wiktionary	acm	Mesopotamian Arabic
Wp/acr	Wikipedia	acr	Achi
Wp/acw	Wikipedia	acw	Hijazi Arabic
Wp/ada	Wikipedia	ada	Adangme
Wp/adu	Wikipedia	adu	Aduge
Wp/ady	Wikipedia	ady	Adyghe
Ws/ady	Wikisource	ady	Adyghe
Wt/ady	Wiktionary	ady	Adyghe
Wy/ady	Wikivoyage	ady	Adyghe
Wt/aeb	Wiktionary	aeb	Tunisian Arabic
Wp/aeb	Wikipedia	aeb	Tunisian Arabic
Wt/aer	Wiktionary	aer	Eastern Arrernte
Ws/af	Wikisource	af	Afrikaans
Wt/af	Wiktionary	af	Afrikaans
Wv/af	Wikiversity	af	Afrikaans
Wy/af	Wikivoyage	af	Afrikaans
Wn/af	Wikinews	af	Afrikaans
Wq/af	Wikiquote	af	Afrikaans
Wb/af	Wikibooks	af	Afrikaans
Wp/af	Wikipedia	af	Afrikaans
Wp/afb	Wikipedia	afb	Gulf Arabic
Wp/agq	Wikipedia	agq	Aghem
Wp/agr	Wikipedia	agr	Aguaruna
Wp/agx	Wikipedia	agx	Aghul
Wp/ahr	Wikipedia	ahr	Ahirani
Wt/ahs	Wiktionary	ahs	Ashe
Wp/aig	Wikipedia	aig	Antigua and Barbuda Creole English
Wb/aii	Wikibooks	aii	Assyrian Neo-Aramaic
Wp/aii	Wikipedia	aii	Assyrian Neo-Aramaic
Wq/ain	Wikiquote	ain	Ainu (Japan)
Wt/ain	Wiktionary	ain	Ainu (Japan)
Wy/ain	Wikivoyage	ain	Ainu (Japan)
Wb/ain	Wikibooks	ain	Ainu (Japan)
Wp/ain	Wikipedia	ain	Ainu (Japan)
Wn/ain	Wikinews	ain	Ainu (Japan)
Wp/ajg	Wikipedia	ajg	Aja (Benin)
Wt/ajg	Wiktionary	ajg	Aja (Benin)
Wp/aju	Wikipedia	aju	Judeo-Moroccan Arabic
Wt/ak	Wiktionary	ak	Akan
Wp/ak	Wikipedia	ak	Akan
Wb/ak	Wikibooks	ak	Akan
Wp/akb	Wikipedia	akb	Batak Angkola
Wp/akf	Wikipedia	akf	Akpa
Ws/akk	Wikisource	akk	Akkadian
Wp/akl	Wikipedia	akl	Aklanon
Wp/akr	Wikipedia	akr	Araki
Wp/akz	Wikipedia	akz	Alabama
Wp/ale	Wikipedia	ale	Aleut
Wp/aln	Wikipedia	aln	Gheg Albanian
Wt/alq	Wiktionary	alq	Algonquin
Wp/alq	Wikipedia	alq	Algonquin
Wp/alr	Wikipedia	alr	Alutor
Wt/alr	Wiktionary	alr	Alutor
Wp/alt	Wikipedia	alt	Southern Altai
Wt/alu	Wiktionary	alu	'Are'are
Wy/am	Wikivoyage	am	Amharic
Wt/am	Wiktionary	am	Amharic
Wq/am	Wikiquote	am	Amharic
Wp/am	Wikipedia	am	Amharic
Wn/am	Wikinews	am	Amharic
Wb/am	Wikibooks	am	Amharic
Wp/ami	Wikipedia	ami	Amis
Wt/ami	Wiktionary	ami	Amis
Wp/amr	Wikipedia	amr	Amarakaeri
Wp/ams	Wikipedia	ams	Southern Amami-Oshima
Wp/amu	Wikipedia	amu	Guerrero Amuzgo
Ws/an	Wikisource	an	Aragonese
Wt/an	Wiktionary	an	Aragonese
Wq/an	Wikiquote	an	Aragonese
Wp/an	Wikipedia	an	Aragonese
Wt/ang	Wiktionary	ang	Old English
Ws/ang	Wikisource	ang	Old English
Wq/ang	Wikiquote	ang	Old English
Wb/ang	Wikibooks	ang	Old English
Wp/ang	Wikipedia	ang	Old English
Wp/ann	Wikipedia	ann	Obolo
Wq/anp	Wikiquote	anp	Angika
Wy/anp	Wikivoyage	anp	Angika
Wt/anp	Wiktionary	anp	Angika
Wn/anp	Wikinews	anp	Angika
Wp/anp	Wikipedia	anp	Angika
Wb/anp	Wikibooks	anp	Angika
Wp/aoa	Wikipedia	aoa	Angolar
Wp/aoc	Wikipedia	aoc	Pemon
Wp/aoi	Wikipedia	aoi	Anindilyakwa
Wt/aoi	Wiktionary	aoi	Anindilyakwa
Wp/aoz	Wikipedia	aoz	Uab Meto
Wp/apc	Wikipedia	apc	Levantine Arabic
Wp/apj	Wikipedia	apj	Jicarilla Apache
Wp/apw	Wikipedia	apw	Western Apache
Wp/aqc	Wikipedia	aqc	Archi
Wt/aqc	Wiktionary	aqc	Archi
Ws/ar	Wikisource	ar	Arabic
Wt/ar	Wiktionary	ar	Arabic
Wv/ar	Wikiversity	ar	Arabic
Wy/ar	Wikivoyage	ar	Arabic
Wq/ar	Wikiquote	ar	Arabic
Wb/ar	Wikibooks	ar	Arabic
Wn/ar	Wikinews	ar	Arabic
Wp/ar	Wikipedia	ar	Arabic
Wp/arc	Wikipedia	arc	Aramaic
Wp/arn	Wikipedia	arn	Mapudungun
Wt/arn	Wiktionary	arn	Mapudungun
Wp/aro	Wikipedia	aro	Araona
Wp/arp	Wikipedia	arp	Arapaho
Ws/arp	Wikisource	arp	Arapaho
Wp/arq	Wikipedia	arq	Algerian Arabic
Ws/arq	Wikisource	arq	Algerian Arabic
Wt/arq	Wiktionary	arq	Algerian Arabic
Wp/ars	Wikipedia	ars	Najdi Arabic
Wb/ary	Wikibooks	ary	Moroccan Arabic
Wp/ary	Wikipedia	ary	Moroccan Arabic
Wq/ary	Wikiquote	ary	Moroccan Arabic
Wt/ary	Wiktionary	ary	Moroccan Arabic
Wt/arz	Wiktionary	arz	Egyptian Arabic
Wq/arz	Wikiquote	arz	Egyptian Arabic
Wp/arz	Wikipedia	arz	Egyptian Arabic
Wb/arz	Wikibooks	arz	Egyptian Arabic
Wt/as	Wiktionary	as	Assamese
Ws/as	Wikisource	as	Assamese
Wy/as	Wikivoyage	as	Assamese
Wq/as	Wikiquote	as	Assamese
Wn/as	Wikinews	as	Assamese
Wb/as	Wikibooks	as	Assamese
Wp/as	Wikipedia	as	Assamese
Wp/asb	Wikipedia	asb	Assiniboine
Wp/ase	Wikipedia	ase	American Sign Language
Wt/ase	Wiktionary	ase	American Sign Language
Wp/ask	Wikipedia	ask	Ashkun
Wt/ast	Wiktionary	ast	Asturian
Wq/ast	Wikiquote	ast	Asturian
Ws/ast	Wikisource	ast	Asturian
Wb/ast	Wikibooks	ast	Asturian
Wp/ast	Wikipedia	ast	Asturian
Wp/atb	Wikipedia	atb	Zaiwa
Wp/atj	Wikipedia	atj	Atikamekw
Wp/atv	Wikipedia	atv	Northern Altai
Wt/atv	Wiktionary	atv	Northern Altai
Wq/av	Wikiquote	av	Avaric
Wt/av	Wiktionary	av	Avaric
Wp/av	Wikipedia	av	Avaric
Ws/ave	Wikisource	ave	Avestan
Wp/avk	Wikipedia	avk	Kotava
Wp/awa	Wikipedia	awa	Awadhi
Wq/awa	Wikiquote	awa	Awadhi
Wt/awa	Wiktionary	awa	Awadhi
Wp/ay	Wikipedia	ay	Aymara
Wt/ay	Wiktionary	ay	Aymara
Wb/ay	Wikibooks	ay	Aymara
Wp/ayl	Wikipedia	ayl	Libyan Arabic
Wp/ayn	Wikipedia	ayn	Sanaani Arabic
Wt/az	Wiktionary	az	Azerbaijani
Ws/az	Wikisource	az	Azerbaijani
Wq/az	Wikiquote	az	Azerbaijani
Wy/az	Wikivoyage	az	Azerbaijani
Wn/az	Wikinews	az	Azerbaijani
Wb/az	Wikibooks	az	Azerbaijani
Wp/az	Wikipedia	az	Azerbaijani
Ws/azb	Wikisource	azb	South Azerbaijani
Wt/azb	Wiktionary	azb	South Azerbaijani
Wy/azb	Wikivoyage	azb	South Azerbaijani
Wq/azb	Wikiquote	azb	South Azerbaijani
Wb/azb	Wikibooks	azb	South Azerbaijani
Wn/azb	Wikinews	azb	South Azerbaijani
Wp/azb	Wikipedia	azb	South Azerbaijani
Ws/ba	Wikisource	ba	Bashkir
Wt/ba	Wiktionary	ba	Bashkir
Wy/ba	Wikivoyage	ba	Bashkir
Wb/ba	Wikibooks	ba	Bashkir
Wq/ba	Wikiquote	ba	Bashkir
Wp/ba	Wikipedia	ba	Bashkir
Wp/bac	Wikipedia	bac	Badui
Wy/bal	Wikivoyage	bal	Baluchi
Wt/bal	Wiktionary	bal	Baluchi
Wb/bal	Wikibooks	bal	Baluchi
Wp/bal	Wikipedia	bal	Baluchi
Wt/ban	Wiktionary	ban	Balinese
Wb/ban	Wikibooks	ban	Balinese
Wp/ban	Wikipedia	ban	Balinese
Ws/ban	Wikisource	ban	Balinese
Wp/bar	Wikipedia	bar	Bavarian
Wp/bas	Wikipedia	bas	Basa (Cameroon)
Wp/bax	Wikipedia	bax	Bamun
Wp/bbc	Wikipedia	bbc	Batak Toba
Wt/bbc	Wiktionary	bbc	Batak Toba
Wp/bbj	Wikipedia	bbj	Ghomálá'
Wp/bbl	Wikipedia	bbl	Bats
Wp/bca	Wikipedia	bca	Central Bai
Wv/bcc	Wikiversity	bcc	Southern Balochi
Wt/bcc	Wiktionary	bcc	Southern Balochi
Wq/bcc	Wikiquote	bcc	Southern Balochi
Wy/bcc	Wikivoyage	bcc	Southern Balochi
Wn/bcc	Wikinews	bcc	Southern Balochi
Wb/bcc	Wikibooks	bcc	Southern Balochi
Wp/bcc	Wikipedia	bcc	Southern Balochi
Wp/bci	Wikipedia	bci	Baoulé
Ws/bcl	Wikisource	bcl	Central Bikol
Wy/bcl	Wikivoyage	bcl	Central Bikol
Wt/bcl	Wiktionary	bcl	Central Bikol
Wq/bcl	Wikiquote	bcl	Central Bikol
Wb/bcl	Wikibooks	bcl	Central Bikol
Wp/bcl	Wikipedia	bcl	Central Bikol
Wp/bdk	Wikipedia	bdk	Budukh
Wp/bdr	Wikipedia	bdr	West Coast Bajau
Wt/be	Wiktionary	be	Belarusian
Ws/be	Wikisource	be	Belarusian
Wv/be	Wikiversity	be	Belarusian
Wy/be	Wikivoyage	be	Belarusian
Wq/be	Wikiquote	be	Belarusian
Wn/be	Wikinews	be	Belarusian
Wb/be	Wikibooks	be	Belarusian
Wp/be	Wikipedia	be	Belarusian
Wp/be-tarask	Wikipedia	be-tarask	Belarusian (Taraškievica orthography)
Wy/be-tarask	Wikivoyage	be-tarask	Belarusian (Taraškievica orthography)
Wp/bec	Wikipedia	bec	Iceve-Maci
Wp/bem	Wikipedia	bem	Bemba (Zambia)
Wp/beu	Wikipedia	beu	Blagar
Wt/bew	Wiktionary	bew	Betawi
Wp/bew	Wikipedia	bew	Betawi
Wp/bfa	Wikipedia	bfa	Bari
Wp/bfi	Wikipedia	bfi	British Sign Language
Wb/bfq	Wikibooks	bfq	Badaga
Wp/bfq	Wikipedia	bfq	Badaga
Wp/bft	Wikipedia	bft	Balti
Ws/bg	Wikisource	bg	Bulgarian
Wt/bg	Wiktionary	bg	Bulgarian
Wv/bg	Wikiversity	bg	Bulgarian
Wy/bg	Wikivoyage	bg	Bulgarian
Wb/bg	Wikibooks	bg	Bulgarian
Wq/bg	Wikiquote	bg	Bulgarian
Wn/bg	Wikinews	bg	Bulgarian
Wp/bg	Wikipedia	bg	Bulgarian
Wp/bgc	Wikipedia	bgc	Haryanvi
Wt/bgc	Wiktionary	bgc	Haryanvi
Wy/bgn	Wikivoyage	bgn	Western Balochi
Wt/bgn	Wiktionary	bgn	Western Balochi
Wq/bgn	Wikiquote	bgn	Western Balochi
Wn/bgn	Wikinews	bgn	Western Balochi
Wb/bgn	Wikibooks	bgn	Western Balochi
Wp/bgn	Wikipedia	bgn	Western Balochi
Wp/bgp	Wikipedia	bgp	Eastern Balochi
Wp/bgx	Wikipedia	bgx	Balkan Gagauz Turkish
Wp/bgz	Wikipedia	bgz	Banggai
Wp/bh	Wikipedia	bh	Bhojpuri
Wp/bhb	Wikipedia	bhb	Bhili
Wp/bhh	Wikipedia	bhh	Bukharic
Wb/bhi	Wikibooks	bhi	Bhilali
Wp/bhi	Wikipedia	bhi	Bhilali
Wy/bho	Wikivoyage	bho	Bhojpuri
Wn/bho	Wikinews	bho	Bhojpuri
Wt/bho	Wiktionary	bho	Bhojpuri
Wb/bho	Wikibooks	bho	Bhojpuri
Wq/bho	Wikiquote	bho	Bhojpuri
Wp/bhp	Wikipedia	bhp	Bima
Wt/bhw	Wiktionary	bhw	Biak
Wp/bhw	Wikipedia	bhw	Biak
Wt/bi	Wiktionary	bi	Bislama
Wp/bi	Wikipedia	bi	Bislama
Wb/bi	Wikibooks	bi	Bislama
Wp/bin	Wikipedia	bin	Bini
Wp/bjm	Wikipedia	bjm	Bajelani
Wt/bjn	Wiktionary	bjn	Banjar
Ws/bjn	Wikisource	bjn	Banjar
Wq/bjn	Wikiquote	bjn	Banjar
Wp/bjn	Wikipedia	bjn	Banjar
Wn/bjn	Wikinews	bjn	Banjar
Wp/bkm	Wikipedia	bkm	Kom (Cameroon)
Wp/bla	Wikipedia	bla	Siksika
Wp/blc	Wikipedia	blc	Bella Coola
Wt/blc	Wiktionary	blc	Bella Coola
Wp/bld	Wikipedia	bld	Bolango
Ws/blk	Wikisource	blk	Pa'O
Wt/blk	Wiktionary	blk	Pa'O
Wp/blk	Wikipedia	blk	Pa'O
Wq/blk	Wikiquote	blk	Pa'O
Wq/bm	Wikiquote	bm	Bambara
Wt/bm	Wiktionary	bm	Bambara
Ws/bm	Wikisource	bm	Bambara
Wb/bm	Wikibooks	bm	Bambara
Wp/bm	Wikipedia	bm	Bambara
Wp/bmr	Wikipedia	bmr	Muinane
Ws/bn	Wikisource	bn	Bangla
Wt/bn	Wiktionary	bn	Bangla
Wv/bn	Wikiversity	bn	Bangla
Wy/bn	Wikivoyage	bn	Bangla
Wq/bn	Wikiquote	bn	Bangla
Wb/bn	Wikibooks	bn	Bangla
Wn/bn	Wikinews	bn	Bangla
Wp/bn	Wikipedia	bn	Bangla
Wt/bnn	Wiktionary	bnn	Bunun
Wp/bnn	Wikipedia	bnn	Bunun
Wp/bno	Wikipedia	bno	Bantoanon
Wt/bnq	Wiktionary	bnq	Bantik
Wb/bo	Wikibooks	bo	Tibetan
Wy/bo	Wikivoyage	bo	Tibetan
Wt/bo	Wiktionary	bo	Tibetan
Ws/bo	Wikisource	bo	Tibetan
Wp/bo	Wikipedia	bo	Tibetan
Wp/bol	Wikipedia	bol	Bole
Wp/bpe	Wikipedia	bpe	Bauni
Wp/bph	Wikipedia	bph	Botlikh
Wp/bpy	Wikipedia	bpy	Bishnupriya
Wp/bqi	Wikipedia	bqi	Bakhtiari
Wy/br	Wikivoyage	br	Breton
Wt/br	Wiktionary	br	Breton
Ws/br	Wikisource	br	Breton
Wp/br	Wikipedia	br	Breton
Wq/br	Wikiquote	br	Breton
Wp/bra	Wikipedia	bra	Braj
Wp/brh	Wikipedia	brh	Brahui
Wn/brh	Wikinews	brh	Brahui
Wp/brx	Wikipedia	brx	Bodo (India)
Wq/brx	Wikiquote	brx	Bodo (India)
Ws/brx	Wikisource	brx	Bodo (India)
Wt/brx	Wiktionary	brx	Bodo (India)
Ws/bs	Wikisource	bs	Bosnian
Wq/bs	Wikiquote	bs	Bosnian
Wt/bs	Wiktionary	bs	Bosnian
Wp/bs	Wikipedia	bs	Bosnian
Wb/bs	Wikibooks	bs	Bosnian
Wn/bs	Wikinews	bs	Bosnian
Wp/bsh	Wikipedia	bsh	Kati
Wp/bsk	Wikipedia	bsk	Burushaski
Wp/bss	Wikipedia	bss	Akoose
Wp/btd	Wikipedia	btd	Batak Dairi
Wt/btd	Wiktionary	btd	Batak Dairi
Wp/bth	Wikipedia	bth	Biatah Bidayuh
Wt/btm	Wiktionary	btm	Mandailing
Wq/btm	Wikiquote	btm	Mandailing
Wp/btm	Wikipedia	btm	Mandailing
Wp/bto	Wikipedia	bto	Rinconada Bikol
Wt/bto	Wiktionary	bto	Rinconada Bikol
Wp/bts	Wikipedia	bts	Batak Simalungun
Wp/btv	Wikipedia	btv	Bateri
Wt/btx	Wiktionary	btx	Batak Karo
Wp/btx	Wikipedia	btx	Batak Karo
Wp/btz	Wikipedia	btz	Batak Alas-Kluet
Wp/bug	Wikipedia	bug	Buginese
Wt/bug	Wiktionary	bug	Buginese
Wp/bum	Wikipedia	bum	Bulu (Cameroon)
Wp/bwi	Wikipedia	bwi	Baniwa
Wp/bwr	Wikipedia	bwr	Bura-Pabir
Wp/bxr	Wikipedia	bxr	Russia Buriat
Wt/bxr	Wiktionary	bxr	Russia Buriat
Wy/bxr	Wikivoyage	bxr	Russia Buriat
Wp/byq	Wikipedia	byq	Basay
Wp/byv	Wikipedia	byv	Medumba
Wp/bzd	Wikipedia	bzd	Bribri
Wp/bzg	Wikipedia	bzg	Babuza
Wp/bzj	Wikipedia	bzj	Belize Kriol English
Wp/bzs	Wikipedia	bzs	Brazilian Sign Language
Ws/ca	Wikisource	ca	Catalan
Wt/ca	Wiktionary	ca	Catalan
Wv/ca	Wikiversity	ca	Catalan
Wy/ca	Wikivoyage	ca	Catalan
Wp/ca	Wikipedia	ca	Catalan
Wq/ca	Wikiquote	ca	Catalan
Wb/ca	Wikibooks	ca	Catalan
Wn/ca	Wikinews	ca	Catalan
Wp/cab	Wikipedia	cab	Garifuna
Wp/cac	Wikipedia	cac	Chuj
Wt/cak	Wiktionary	cak	Kaqchikel
Wp/cak	Wikipedia	cak	Kaqchikel
Wp/car	Wikipedia	car	Galibi Carib
Wt/cbk	Wiktionary	cbk	Chavacano
Wp/cbk-zam	Wikipedia	cbk-zam	Chavacano
Wp/ccp	Wikipedia	ccp	Chakma
Wt/ccp	Wiktionary	ccp	Chakma
Ws/cdo	Wikisource	cdo	Mindong
Wt/cdo	Wiktionary	cdo	Mindong
Wp/cdo	Wikipedia	cdo	Mindong
Wn/cdo	Wikinews	cdo	Mindong
Wb/cdo	Wikibooks	cdo	Mindong
Wp/ce	Wikipedia	ce	Chechen
Wt/ce	Wiktionary	ce	Chechen
Wb/ceb	Wikibooks	ceb	Cebuano
Wn/ceb	Wikinews	ceb	Cebuano
Wp/ceb	Wikipedia	ceb	Cebuano
Wt/ceb	Wiktionary	ceb	Cebuano
Wy/ceb	Wikivoyage	ceb	Cebuano
Wp/cfm	Wikipedia	cfm	Falam Chin
Wt/ch	Wiktionary	ch	Chamorro
Wp/ch	Wikipedia	ch	Chamorro
Wb/ch	Wikibooks	ch	Chamorro
Wp/chb	Wikipedia	chb	Chibcha
Wt/chb	Wiktionary	chb	Chibcha
Wp/chg	Wikipedia	chg	Chagatai
Wp/chn	Wikipedia	chn	Chinook jargon
Wt/chn	Wiktionary	chn	Chinook jargon
Wp/cho	Wikipedia	cho	Choctaw
Wt/cho	Wiktionary	cho	Choctaw
Wp/chp	Wikipedia	chp	Chipewyan
Wp/chr	Wikipedia	chr	Cherokee
Ws/chr	Wikisource	chr	Cherokee
Wt/chr	Wiktionary	chr	Cherokee
Ws/chu	Wikisource	chu	New Church Slavic
Wp/chy	Wikipedia	chy	Cheyenne
Wq/chy	Wikiquote	chy	Cheyenne
Wt/chy	Wiktionary	chy	Cheyenne
Wp/cia	Wikipedia	cia	Cia-Cia
Wt/cic	Wiktionary	cic	Chickasaw
Wp/cic	Wikipedia	cic	Chickasaw
Wp/cim	Wikipedia	cim	Cimbrian
Wt/cim	Wiktionary	cim	Cimbrian
Wp/ciw	Wikipedia	ciw	Chippewa
Wp/cja	Wikipedia	cja	Western Cham
Wp/cjm	Wikipedia	cjm	Eastern Cham
Wp/cjs	Wikipedia	cjs	Shor
Wp/cjy	Wikipedia	cjy	Jinyu Chinese
Wq/ckb	Wikiquote	ckb	Central Kurdish
Wt/ckb	Wiktionary	ckb	Central Kurdish
Wy/ckb	Wikivoyage	ckb	Central Kurdish
Wp/ckb	Wikipedia	ckb	Central Kurdish
Wb/ckb	Wikibooks	ckb	Central Kurdish
Wn/ckb	Wikinews	ckb	Central Kurdish
Wp/cko	Wikipedia	cko	Anufo
Wt/ckt	Wiktionary	ckt	Chukot
Wp/ckt	Wikipedia	ckt	Chukot
Wp/cku	Wikipedia	cku	Koasati
Wp/ckv	Wikipedia	ckv	Kavalan
Wp/clm	Wikipedia	clm	Clallam
Wp/clw	Wikipedia	clw	Chulym
Wp/cng	Wikipedia	cng	Northern Qiang
Wn/cnh	Wikinews	cnh	Hakha Chin
Wp/cnh	Wikipedia	cnh	Hakha Chin
Wt/cnh	Wiktionary	cnh	Hakha Chin
Wp/cni	Wikipedia	cni	Asháninka
Ws/cnr	Wikisource	cnr	Montenegrin
Wp/cnr	Wikipedia	cnr	Montenegrin
Wp/cnu	Wikipedia	cnu	Chenoua
Wy/co	Wikivoyage	co	Corsican
Wt/co	Wiktionary	co	Corsican
Ws/co	Wikisource	co	Corsican
Wq/co	Wikiquote	co	Corsican
Wp/co	Wikipedia	co	Corsican
Wb/co	Wikibooks	co	Corsican
Wt/cod	Wiktionary	cod	Cocama-Cocamilla
Ws/cop	Wikisource	cop	Coptic
Wp/cop	Wikipedia	cop	Coptic
Wt/cop	Wiktionary	cop	Coptic
Wp/cpi	Wikipedia	cpi	Chinese Pidgin English
Wp/cps	Wikipedia	cps	Capiznon
Wt/cpx	Wiktionary	cpx	Pu-Xian Chinese
Ws/cpx	Wikisource	cpx	Pu-Xian Chinese
Wp/cpx	Wikipedia	cpx	Pu-Xian Chinese
Wn/cpx	Wikinews	cpx	Pu-Xian Chinese
Wq/cr	Wikiquote	cr	Cree
Wt/cr	Wiktionary	cr	Cree
Wp/cr	Wikipedia	cr	Cree
Wp/crd	Wikipedia	crd	Coeur d'Alene
Wp/crg	Wikipedia	crg	Michif
Wp/crh	Wikipedia	crh	Crimean Tatar
Wt/crh	Wiktionary	crh	Crimean Tatar
Wp/cri	Wikipedia	cri	Sãotomense
Wp/crk	Wikipedia	crk	Plains Cree
Wp/crs	Wikipedia	crs	Seselwa Creole French
Wt/crs	Wiktionary	crs	Seselwa Creole French
Wt/cs	Wiktionary	cs	Czech
Wy/cs	Wikivoyage	cs	Czech
Ws/cs	Wikisource	cs	Czech
Wv/cs	Wikiversity	cs	Czech
Wq/cs	Wikiquote	cs	Czech
Wb/cs	Wikibooks	cs	Czech
Wn/cs	Wikinews	cs	Czech
Wp/cs	Wikipedia	cs	Czech
Wt/csb	Wiktionary	csb	Kashubian
Ws/csb	Wikisource	csb	Kashubian
Wb/csb	Wikibooks	csb	Kashubian
Wp/csb	Wikipedia	csb	Kashubian
Wp/csm	Wikipedia	csm	Central Sierra Miwok
Wt/csm	Wiktionary	csm	Central Sierra Miwok
Wp/csn	Wikipedia	csn	Colombian Sign Language
Wp/csp	Wikipedia	csp	Southern Ping Chinese
Wp/csy	Wikipedia	csy	Siyin Chin
Wp/ctc	Wikipedia	ctc	Chetco
Wp/ctd	Wikipedia	ctd	Tedim Chin
Wp/ctg	Wikipedia	ctg	Chittagonian
Wp/cts	Wikipedia	cts	Northern Catanduanes Bikol
Wp/ctu	Wikipedia	ctu	Chol
Wp/cu	Wikipedia	cu	Church Slavic
Ws/cu	Wikisource	cu	Church Slavic
Wp/cuk	Wikipedia	cuk	San Blas Kuna
Wp/cuq	Wikipedia	cuq	Cun
Wp/cux	Wikipedia	cux	Tepeuxila Cuicatec
Wq/cv	Wikiquote	cv	Chuvash
Wt/cv	Wiktionary	cv	Chuvash
Ws/cv	Wikisource	cv	Chuvash
Wn/cv	Wikinews	cv	Chuvash
Wp/cv	Wikipedia	cv	Chuvash
Wb/cv	Wikibooks	cv	Chuvash
Wq/cy	Wikiquote	cy	Welsh
Ws/cy	Wikisource	cy	Welsh
Wt/cy	Wiktionary	cy	Welsh
Wy/cy	Wikivoyage	cy	Welsh
Wb/cy	Wikibooks	cy	Welsh
Wn/cy	Wikinews	cy	Welsh
Wp/cy	Wikipedia	cy	Welsh
Wp/czh	Wikipedia	czh	Huizhou Chinese
Wt/czo	Wiktionary	czo	Min Zhong Chinese
Wp/czo	Wikipedia	czo	Min Zhong Chinese
Wy/da	Wikivoyage	da	Danish
Wq/da	Wikiquote	da	Danish
Ws/da	Wikisource	da	Danish
Wt/da	Wiktionary	da	Danish
Wb/da	Wikibooks	da	Danish
Wn/da	Wikinews	da	Danish
Wp/da	Wikipedia	da	Danish
Wp/dag	Wikipedia	dag	Dagbani
Wt/dag	Wiktionary	dag	Dagbani
Wp/dar	Wikipedia	dar	Dargwa
Wt/dcr	Wiktionary	dcr	Negerhollands
Wp/ddg	Wikipedia	ddg	Fataluku
Wp/ddn	Wikipedia	ddn	Dendi (Benin)
Wp/ddo	Wikipedia	ddo	Dido
Wt/ddo	Wiktionary	ddo	Dido
Wt/de	Wiktionary	de	German
Ws/de	Wikisource	de	German
Wv/de	Wikiversity	de	German
Wy/de	Wikivoyage	de	German
Wq/de	Wikiquote	de	German
Wb/de	Wikibooks	de	German
Wn/de	Wikinews	de	German
Wp/de	Wikipedia	de	German
Wt/den	Wiktionary	den	Slave (Athapascan)
Wp/dga	Wikipedia	dga	Dagaare
Wt/dgo	Wiktionary	dgo	Dogri (individual language)
Wp/dgo	Wikipedia	dgo	Dogri (individual language)
Wt/dgr	Wiktionary	dgr	Tlicho
Wp/dhv	Wikipedia	dhv	Dehu
Wp/din	Wikipedia	din	Dinka
Wt/diq	Wiktionary	diq	Zazaki
Ws/diq	Wikisource	diq	Zazaki
Wy/diq	Wikivoyage	diq	Zazaki
Wv/diq	Wikiversity	diq	Zazaki
Wp/diq	Wikipedia	diq	Zazaki
Wq/diq	Wikiquote	diq	Zazaki
Wb/diq	Wikibooks	diq	Zazaki
Wn/diq	Wikinews	diq	Zazaki
Wp/dis	Wikipedia	dis	Dimasa
Wp/dje	Wikipedia	dje	Zarma
Wp/dlg	Wikipedia	dlg	Dolgan
Ws/dlm	Wikisource	dlm	Dalmatian
Wp/dml	Wikipedia	dml	Dameli
Wb/dng	Wikibooks	dng	Dungan
Wp/dng	Wikipedia	dng	Dungan
Wt/dng	Wiktionary	dng	Dungan
Wp/dnj	Wikipedia	dnj	Dan
Wp/dru	Wikipedia	dru	Rukai
Wp/dsb	Wikipedia	dsb	Lower Sorbian
Ws/dsb	Wikisource	dsb	Lower Sorbian
Wt/dtp	Wiktionary	dtp	Central Dusun
Wq/dtp	Wikiquote	dtp	Central Dusun
Wn/dtp	Wikinews	dtp	Central Dusun
Wb/dtp	Wikibooks	dtp	Central Dusun
Wp/dtp	Wikipedia	dtp	Central Dusun
Wb/dty	Wikibooks	dty	Doteli
Wp/dty	Wikipedia	dty	Doteli
Wt/dty	Wiktionary	dty	Doteli
Wy/dty	Wikivoyage	dty	Doteli
Wp/dua	Wikipedia	dua	Duala
Wt/dua	Wiktionary	dua	Duala
Wp/dun	Wikipedia	dun	Dusun Deyah
Wb/dv	Wikibooks	dv	Divehi
Wn/dv	Wikinews	dv	Divehi
Wp/dv	Wikipedia	dv	Divehi
Wt/dv	Wiktionary	dv	Divehi
Wt/dwr	Wiktionary	dwr	Dawro
Wb/dz	Wikibooks	dz	Dzongkha
Wp/dz	Wikipedia	dz	Dzongkha
Wq/dz	Wikiquote	dz	Dzongkha
Wt/dz	Wiktionary	dz	Dzongkha
Wt/ee	Wiktionary	ee	Ewe
Wp/ee	Wikipedia	ee	Ewe
Wp/efi	Wikipedia	efi	Efik
Wt/egl	Wiktionary	egl	Emilian
Ws/egy	Wikisource	egy	Egyptian (Ancient)
Wp/ekp	Wikipedia	ekp	Ekpeye
Wp/eky	Wikipedia	eky	Eastern Kayah
Wt/el	Wiktionary	el	Greek
Ws/el	Wikisource	el	Greek
Wy/el	Wikivoyage	el	Greek
Wv/el	Wikiversity	el	Greek
Wq/el	Wikiquote	el	Greek
Wb/el	Wikibooks	el	Greek
Wn/el	Wikinews	el	Greek
Wp/el	Wikipedia	el	Greek
Wp/elm	Wikipedia	elm	Eleme
Wp/eml	Wikipedia	eml	Emiliano-Romagnolo
Ws/en	Wikisource	en	English
Wt/en	Wiktionary	en	English
Wv/en	Wikiversity	en	English
Wy/en	Wikivoyage	en	English
Wq/en	Wikiquote	en	English
Wb/en	Wikibooks	en	English
Wn/en	Wikinews	en	English
Wp/en	Wikipedia	en	English
Wp/enf	Wikipedia	enf	Forest Enets
Wp/enx	Wikipedia	enx	Enxet
Ws/eo	Wikisource	eo	Esperanto
Wy/eo	Wikivoyage	eo	Esperanto
Wt/eo	Wiktionary	eo	Esperanto
Wv/eo	Wikiversity	eo	Esperanto
Wq/eo	Wikiquote	eo	Esperanto
Wb/eo	Wikibooks	eo	Esperanto
Wn/eo	Wikinews	eo	Esperanto
Wp/eo	Wikipedia	eo	Esperanto
Wt/es	Wiktionary	es	Spanish
Ws/es	Wikisource	es	Spanish
Wy/es	Wikivoyage	es	Spanish
Wv/es	Wikiversity	es	Spanish
Wq/es	Wikiquote	es	Spanish
Wb/es	Wikibooks	es	Spanish
Wn/es	Wikinews	es	Spanish
Wp/es	Wikipedia	es	Spanish
Wt/ese	Wiktionary	ese	Ese Ejja
Wp/esg	Wikipedia	esg	Aheri Gondi
Wp/esl	Wikipedia	esl	Egypt Sign Language
Wp/ess	Wikipedia	ess	Central Siberian Yupik
Wp/esu	Wikipedia	esu	Central Yupik
Wy/et	Wikivoyage	et	Estonian
Ws/et	Wikisource	et	Estonian
Wt/et	Wiktionary	et	Estonian
Wv/et	Wikiversity	et	Estonian
Wb/et	Wikibooks	et	Estonian
Wq/et	Wikiquote	et	Estonian
Wn/et	Wikinews	et	Estonian
Wp/et	Wikipedia	et	Estonian
Wt/ett	Wiktionary	ett	Etruscan
Ws/eu	Wikisource	eu	Basque
Wq/eu	Wikiquote	eu	Basque
Wt/eu	Wiktionary	eu	Basque
Wy/eu	Wikivoyage	eu	Basque
Wb/eu	Wikibooks	eu	Basque
Wn/eu	Wikinews	eu	Basque
Wp/eu	Wikipedia	eu	Basque
Wt/eve	Wiktionary	eve	Even
Wq/eve	Wikiquote	eve	Even
Wb/eve	Wikibooks	eve	Even
Wp/eve	Wikipedia	eve	Even
Wt/evn	Wiktionary	evn	Evenki
Wp/evn	Wikipedia	evn	Evenki
Wp/ewo	Wikipedia	ewo	Ewondo
Ws/ext	Wikisource	ext	Extremaduran
Wp/ext	Wikipedia	ext	Extremaduran
Ws/fa	Wikisource	fa	Persian
Wt/fa	Wiktionary	fa	Persian
Wv/fa	Wikiversity	fa	Persian
Wy/fa	Wikivoyage	fa	Persian
Wq/fa	Wikiquote	fa	Persian
Wb/fa	Wikibooks	fa	Persian
Wn/fa	Wikinews	fa	Persian
Wp/fa	Wikipedia	fa	Persian
Wq/fat	Wikiquote	fat	Fanti
Wp/fat	Wikipedia	fat	Fanti
Wp/ff	Wikipedia	ff	Fula
Wt/fi	Wiktionary	fi	Finnish
Ws/fi	Wikisource	fi	Finnish
Wy/fi	Wikivoyage	fi	Finnish
Wv/fi	Wikiversity	fi	Finnish
Wq/fi	Wikiquote	fi	Finnish
Wb/fi	Wikibooks	fi	Finnish
Wn/fi	Wikinews	fi	Finnish
Wp/fi	Wikipedia	fi	Finnish
Wt/fil	Wiktionary	fil	Filipino
Wy/fit	Wikivoyage	fit	Tornedalen Finnish
Wt/fit	Wiktionary	fit	Tornedalen Finnish
Wp/fit	Wikipedia	fit	Tornedalen Finnish
Wq/fj	Wikiquote	fj	Fijian
Wt/fj	Wiktionary	fj	Fijian
Wy/fj	Wikivoyage	fj	Fijian
Wp/fj	Wikipedia	fj	Fijian
Wb/fj	Wikibooks	fj	Fijian
Wn/fj	Wikinews	fj	Fijian
Wt/fkv	Wiktionary	fkv	Kven Finnish
Wy/fkv	Wikivoyage	fkv	Kven Finnish
Wp/fkv	Wikipedia	fkv	Kven Finnish
Wp/fla	Wikipedia	fla	Kalispel-Pend d'Oreille
Wb/fmp	Wikibooks	fmp	Fe'fe'
Wp/fmp	Wikipedia	fmp	Fe'fe'
Ws/fo	Wikisource	fo	Faroese
Wy/fo	Wikivoyage	fo	Faroese
Wt/fo	Wiktionary	fo	Faroese
Wp/fo	Wikipedia	fo	Faroese
Wb/fo	Wikibooks	fo	Faroese
Wp/fon	Wikipedia	fon	Fon
Wt/fr	Wiktionary	fr	French
Ws/fr	Wikisource	fr	French
Wv/fr	Wikiversity	fr	French
Wy/fr	Wikivoyage	fr	French
Wp/fr	Wikipedia	fr	French
Wq/fr	Wikiquote	fr	French
Wb/fr	Wikibooks	fr	French
Wn/fr	Wikinews	fr	French
Wt/frc	Wiktionary	frc	Cajun French
Wp/frc	Wikipedia	frc	Cajun French
Wt/frp	Wiktionary	frp	Arpitan
Wy/frp	Wikivoyage	frp	Arpitan
Wp/frp	Wikipedia	frp	Arpitan
Wp/frr	Wikipedia	frr	Northern Frisian
Wp/frs	Wikipedia	frs	Eastern Frisian
Wp/fuc	Wikipedia	fuc	Pulaar
Wb/fur	Wikibooks	fur	Friulian
Wn/fur	Wikinews	fur	Friulian
Wp/fur	Wikipedia	fur	Friulian
Wt/fur	Wiktionary	fur	Friulian
Wy/fur	Wikivoyage	fur	Friulian
Wp/fvr	Wikipedia	fvr	Fur
Ws/fy	Wikisource	fy	Western Frisian
Wt/fy	Wiktionary	fy	Western Frisian
Wy/fy	Wikivoyage	fy	Western Frisian
Wb/fy	Wikibooks	fy	Western Frisian
Wp/fy	Wikipedia	fy	Western Frisian
Wn/fy	Wikinews	fy	Western Frisian
Ws/ga	Wikisource	ga	Irish
Wt/ga	Wiktionary	ga	Irish
Wy/ga	Wikivoyage	ga	Irish
Wq/ga	Wikiquote	ga	Irish
Wp/ga	Wikipedia	ga	Irish
Wb/ga	Wikibooks	ga	Irish
Wp/gaa	Wikipedia	gaa	Ga
Wp/gag	Wikipedia	gag	Gagauz
Ws/gag	Wikisource	gag	Gagauz
Wt/gag	Wiktionary	gag	Gagauz
Wt/gan	Wiktionary	gan	Gan
Wp/gan	Wikipedia	gan	Gan
Wp/gay	Wikipedia	gay	Gayo
Wp/gbm	Wikipedia	gbm	Garhwali
Wt/gbm	Wiktionary	gbm	Garhwali
Wp/gcf	Wikipedia	gcf	Guadeloupean Creole French
Wt/gcf	Wiktionary	gcf	Guadeloupean Creole French
Wp/gcr	Wikipedia	gcr	Guianan Creole
Wp/gct	Wikipedia	gct	Colonia Tovar German
Wn/gd	Wikinews	gd	Scottish Gaelic
Wp/gd	Wikipedia	gd	Scottish Gaelic
Ws/gd	Wikisource	gd	Scottish Gaelic
Wt/gd	Wiktionary	gd	Scottish Gaelic
Wp/gdo	Wikipedia	gdo	Ghodoberi
Wt/gdo	Wiktionary	gdo	Ghodoberi
Wt/gil	Wiktionary	gil	Gilbertese
Wp/gil	Wikipedia	gil	Gilbertese
Wp/gju	Wikipedia	gju	Gujari
Wt/gl	Wiktionary	gl	Galician
Wq/gl	Wikiquote	gl	Galician
Ws/gl	Wikisource	gl	Galician
Wy/gl	Wikivoyage	gl	Galician
Wb/gl	Wikibooks	gl	Galician
Wn/gl	Wikinews	gl	Galician
Wp/gl	Wikipedia	gl	Galician
Wt/gld	Wiktionary	gld	Nanai
Wp/gld	Wikipedia	gld	Nanai
Wb/glk	Wikibooks	glk	Gilaki
Wn/glk	Wikinews	glk	Gilaki
Wp/glk	Wikipedia	glk	Gilaki
Wq/glk	Wikiquote	glk	Gilaki
Wt/glk	Wiktionary	glk	Gilaki
Wy/glk	Wikivoyage	glk	Gilaki
Wp/gml	Wikipedia	gml	Middle Low German
Wt/gn	Wiktionary	gn	Guarani
Wp/gn	Wikipedia	gn	Guarani
Wb/gn	Wikibooks	gn	Guarani
Wp/gnb	Wikipedia	gnb	Gangte
Wb/gom	Wikibooks	gom	Goan Konkani
Wp/gom	Wikipedia	gom	Goan Konkani
Wt/gom	Wiktionary	gom	Goan Konkani
Wt/gor	Wiktionary	gor	Gorontalo
Wq/gor	Wikiquote	gor	Gorontalo
Wp/gor	Wikipedia	gor	Gorontalo
Wt/got	Wiktionary	got	Gothic
Ws/got	Wikisource	got	Gothic
Wp/got	Wikipedia	got	Gothic
Wb/got	Wikibooks	got	Gothic
Wp/gpe	Wikipedia	gpe	Ghanaian Pidgin
Ws/grc	Wikisource	grc	Ancient Greek (to 1453)
Wt/grc	Wiktionary	grc	Ancient Greek (to 1453)
Wq/grc	Wikiquote	grc	Ancient Greek (to 1453)
Wb/grc	Wikibooks	grc	Ancient Greek (to 1453)
Wp/grc	Wikipedia	grc	Ancient Greek (to 1453)
Wp/grt	Wikipedia	grt	Garo
Wp/gsw	Wikipedia	gsw	Alemannic
Ws/gu	Wikisource	gu	Gujarati
Wt/gu	Wiktionary	gu	Gujarati
Wy/gu	Wikivoyage	gu	Gujarati
Wq/gu	Wikiquote	gu	Gujarati
Wn/gu	Wikinews	gu	Gujarati
Wb/gu	Wikibooks	gu	Gujarati
Wp/gu	Wikipedia	gu	Gujarati
Wp/gub	Wikipedia	gub	Guajajára
Wt/guc	Wiktionary	guc	Wayuu
Wp/guc	Wikipedia	guc	Wayuu
Wp/gui	Wikipedia	gui	Eastern Bolivian Guaraní
Wp/gul	Wikipedia	gul	Sea Island Creole English
Wp/gur	Wikipedia	gur	Frafra
Wq/guw	Wikiquote	guw	Gun
Wt/guw	Wiktionary	guw	Gun
Wp/guw	Wikipedia	guw	Gun
Wn/guw	Wikinews	guw	Gun
Wt/gv	Wiktionary	gv	Manx
Wp/gv	Wikipedia	gv	Manx
Wp/gvr	Wikipedia	gvr	Gurung
Wp/gwc	Wikipedia	gwc	Gawri
Wp/gwi	Wikipedia	gwi	Gwichʼin
Wp/gwt	Wikipedia	gwt	Gawar-Bati
Wp/gyn	Wikipedia	gyn	Guyanese Creole English
Wq/ha	Wikiquote	ha	Hausa
Wt/ha	Wiktionary	ha	Hausa
Wy/ha	Wikivoyage	ha	Hausa
Wp/ha	Wikipedia	ha	Hausa
Wb/ha	Wikibooks	ha	Hausa
Wn/ha	Wikinews	ha	Hausa
Wp/haa	Wikipedia	haa	Han
Wp/hac	Wikipedia	hac	Gurani
Wy/hak	Wikivoyage	hak	Hakka Chinese
Wt/hak	Wiktionary	hak	Hakka Chinese
Wb/hak	Wikibooks	hak	Hakka Chinese
Wp/hak	Wikipedia	hak	Hakka Chinese
Wp/har	Wikipedia	har	Harari
Wt/hat	Wiktionary	hat	Haitian
Wp/haw	Wikipedia	haw	Hawaiian
Wq/haw	Wikiquote	haw	Hawaiian
Ws/haw	Wikisource	haw	Hawaiian
Wt/haw	Wiktionary	haw	Hawaiian
Wy/haw	Wikivoyage	haw	Hawaiian
Wp/haz	Wikipedia	haz	Hazaragi
Wy/hbs	Wikivoyage	hbs	Serbo-Croatian
Wt/he	Wiktionary	he	Hebrew
Ws/he	Wikisource	he	Hebrew
Wv/he	Wikiversity	he	Hebrew
Wy/he	Wikivoyage	he	Hebrew
Wq/he	Wikiquote	he	Hebrew
Wb/he	Wikibooks	he	Hebrew
Wn/he	Wikinews	he	Hebrew
Wp/he	Wikipedia	he	Hebrew
Wt/hi	Wiktionary	hi	Hindi
Ws/hi	Wikisource	hi	Hindi
Wv/hi	Wikiversity	hi	Hindi
Wy/hi	Wikivoyage	hi	Hindi
Wq/hi	Wikiquote	hi	Hindi
Wb/hi	Wikibooks	hi	Hindi
Wn/hi	Wikinews	hi	Hindi
Wp/hi	Wikipedia	hi	Hindi
Wq/hif	Wikiquote	hif	Fiji Hindi
Wt/hif	Wiktionary	hif	Fiji Hindi
Wy/hif	Wikivoyage	hif	Fiji Hindi
Wn/hif	Wikinews	hif	Fiji Hindi
Wp/hif	Wikipedia	hif	Fiji Hindi
Wb/hif	Wikibooks	hif	Fiji Hindi
Wp/hil	Wikipedia	hil	Hiligaynon
Wp/hji	Wikipedia	hji	Haji
Wp/hke	Wikipedia	hke	Hunde
Wt/hks	Wiktionary	hks	Hong Kong Sign Language
Wp/hmd	Wikipedia	hmd	Large Flowery Miao
Wp/hmr	Wikipedia	hmr	Hmar
Wp/hnd	Wikipedia	hnd	Southern Hindko
Wt/hnd	Wiktionary	hnd	Southern Hindko
Wn/hnd	Wikinews	hnd	Southern Hindko
Wp/hne	Wikipedia	hne	Chhattisgarhi
Wp/hni	Wikipedia	hni	Hani
Wp/hno	Wikipedia	hno	Northern Hindko
Wp/ho	Wikipedia	ho	Hiri Motu
Wp/hoc	Wikipedia	hoc	Ho
Wt/hoc	Wiktionary	hoc	Ho
Wp/hoj	Wikipedia	hoj	Hadothi
Wt/hr	Wiktionary	hr	Croatian
Ws/hr	Wikisource	hr	Croatian
Wv/hr	Wikiversity	hr	Croatian
Wq/hr	Wikiquote	hr	Croatian
Wn/hr	Wikinews	hr	Croatian
Wb/hr	Wikibooks	hr	Croatian
Wp/hr	Wikipedia	hr	Croatian
Wp/hrx	Wikipedia	hrx	Hunsrik
Ws/hsb	Wikisource	hsb	Upper Sorbian
Wt/hsb	Wiktionary	hsb	Upper Sorbian
Wp/hsb	Wikipedia	hsb	Upper Sorbian
Wt/hsn	Wiktionary	hsn	Xiang Chinese
Wp/hsn	Wikipedia	hsn	Xiang Chinese
Wt/ht	Wiktionary	ht	Haitian Creole
Ws/ht	Wikisource	ht	Haitian Creole
Wq/ht	Wikiquote	ht	Haitian Creole
Wb/ht	Wikibooks	ht	Haitian Creole
Wp/ht	Wikipedia	ht	Haitian Creole
Wt/hu	Wiktionary	hu	Hungarian
Ws/hu	Wikisource	hu	Hungarian
Wv/hu	Wikiversity	hu	Hungarian
Wy/hu	Wikivoyage	hu	Hungarian
Wq/hu	Wikiquote	hu	Hungarian
Wn/hu	Wikinews	hu	Hungarian
Wb/hu	Wikibooks	hu	Hungarian
Wp/hu	Wikipedia	hu	Hungarian
Wp/hus	Wikipedia	hus	Huastec
Wp/hwc	Wikipedia	hwc	Hawai'i Creole English
Wt/hwc	Wiktionary	hwc	Hawai'i Creole English
Ws/hy	Wikisource	hy	Armenian
Wt/hy	Wiktionary	hy	Armenian
Wy/hy	Wikivoyage	hy	Armenian
Wq/hy	Wikiquote	hy	Armenian
Wn/hy	Wikinews	hy	Armenian
Wb/hy	Wikibooks	hy	Armenian
Wp/hy	Wikipedia	hy	Armenian
Wp/hyw	Wikipedia	hyw	Western Armenian
Wp/hz	Wikipedia	hz	Herero
Ws/ia	Wikisource	ia	Interlingua
Wt/ia	Wiktionary	ia	Interlingua
Wb/ia	Wikibooks	ia	Interlingua
Wp/ia	Wikipedia	ia	Interlingua
Wp/iar	Wikipedia	iar	Purari
Wp/iba	Wikipedia	iba	Iban
Wt/iba	Wiktionary	iba	Iban
Wp/ibb	Wikipedia	ibb	Ibibio
Wp/ibg	Wikipedia	ibg	Ibanag
Wt/icr	Wiktionary	icr	Islander Creole English
Wp/icr	Wikipedia	icr	Islander Creole English
Wt/id	Wiktionary	id	Indonesian
Ws/id	Wikisource	id	Indonesian
Wv/id	Wikiversity	id	Indonesian
Wy/id	Wikivoyage	id	Indonesian
Wp/id	Wikipedia	id	Indonesian
Wq/id	Wikiquote	id	Indonesian
Wn/id	Wikinews	id	Indonesian
Wb/id	Wikibooks	id	Indonesian
Wp/ie	Wikipedia	ie	Interlingue
Wt/ie	Wiktionary	ie	Interlingue
Wn/ie	Wikinews	ie	Interlingue
Wb/ie	Wikibooks	ie	Interlingue
Wt/ig	Wiktionary	ig	Igbo
Wq/ig	Wikiquote	ig	Igbo
Wp/ig	Wikipedia	ig	Igbo
Wt/igl	Wiktionary	igl	Igala
Wp/igl	Wikipedia	igl	Igala
Wp/ii	Wikipedia	ii	Sichuan Yi
Wp/ijc	Wikipedia	ijc	Izon
Wb/ik	Wikibooks	ik	Inupiaq
Wp/ik	Wikipedia	ik	Inupiaq
Wt/ik	Wiktionary	ik	Inupiaq
Wp/ikt	Wikipedia	ikt	Inuinnaqtun
Wp/ili	Wikipedia	ili	Ili Turki
Wt/ilo	Wiktionary	ilo	Iloko
Wp/ilo	Wikipedia	ilo	Iloko
Wp/ilp	Wikipedia	ilp	Iranun (Philippines)
Wp/inh	Wikipedia	inh	Ingush
Wt/inh	Wiktionary	inh	Ingush
Wp/ins	Wikipedia	ins	Indian Sign Language
Wt/io	Wiktionary	io	Ido
Ws/io	Wikisource	io	Ido
Wq/io	Wikiquote	io	Ido
Wp/io	Wikipedia	io	Ido
Ws/is	Wikisource	is	Icelandic
Wt/is	Wiktionary	is	Icelandic
Wq/is	Wikiquote	is	Icelandic
Wy/is	Wikivoyage	is	Icelandic
Wn/is	Wikinews	is	Icelandic
Wb/is	Wikibooks	is	Icelandic
Wp/is	Wikipedia	is	Icelandic
Wp/ish	Wikipedia	ish	Esan
Wp/isk	Wikipedia	isk	Ishkashimi
Wp/ist	Wikipedia	ist	Istriot
Ws/ist	Wikisource	ist	Istriot
Wp/isv	Wikipedia	isv	Interslavic
Wt/it	Wiktionary	it	Italian
Ws/it	Wikisource	it	Italian
Wv/it	Wikiversity	it	Italian
Wy/it	Wikivoyage	it	Italian
Wq/it	Wikiquote	it	Italian
Wb/it	Wikibooks	it	Italian
Wn/it	Wikinews	it	Italian
Wp/it	Wikipedia	it	Italian
Wp/itd	Wikipedia	itd	Southern Tidung
Wp/itk	Wikipedia	itk	Judeo-Italian
Wp/itl	Wikipedia	itl	Itelmen
Wt/iu	Wiktionary	iu	Inuktitut
Ws/iu	Wikisource	iu	Inuktitut
Wp/iu	Wikipedia	iu	Inuktitut
Wp/ivv	Wikipedia	ivv	Ivatan
Wp/ixl	Wikipedia	ixl	Ixil
Wp/izh	Wikipedia	izh	Ingrian
Wt/ja	Wiktionary	ja	Japanese
Ws/ja	Wikisource	ja	Japanese
Wv/ja	Wikiversity	ja	Japanese
Wy/ja	Wikivoyage	ja	Japanese
Wn/ja	Wikinews	ja	Japanese
Wq/ja	Wikiquote	ja	Japanese
Wb/ja	Wikibooks	ja	Japanese
Wp/ja	Wikipedia	ja	Japanese
Wt/jac	Wiktionary	jac	Popti'
Wt/jam	Wiktionary	jam	Jamaican Creole English
Wp/jam	Wikipedia	jam	Jamaican Creole English
Wb/jam	Wikibooks	jam	Jamaican Creole English
Wq/jat	Wikiquote	jat	Jakati
Wt/jat	Wiktionary	jat	Jakati
Wy/jat	Wikivoyage	jat	Jakati
Wp/jat	Wikipedia	jat	Jakati
Wb/jat	Wikibooks	jat	Jakati
Wn/jat	Wikinews	jat	Jakati
Wt/jax	Wiktionary	jax	Jambi Malay
Wp/jax	Wikipedia	jax	Jambi Malay
Wn/jbo	Wikinews	jbo	Lojban
Wy/jbo	Wikivoyage	jbo	Lojban
Wt/jbo	Wiktionary	jbo	Lojban
Wq/jbo	Wikiquote	jbo	Lojban
Wp/jbo	Wikipedia	jbo	Lojban
Wp/jct	Wikipedia	jct	Krymchak
Wp/jdt	Wikipedia	jdt	Judeo-Tat
Wt/jdt	Wiktionary	jdt	Judeo-Tat
Wp/jge	Wikipedia	jge	Judeo-Georgian
Wp/jgo	Wikipedia	jgo	Ngomba
Wt/jje	Wiktionary	jje	Jejueo
Wp/jje	Wikipedia	jje	Jejueo
Wb/jje	Wikibooks	jje	Jejueo
Wp/jkr	Wikipedia	jkr	Koro (India)
Wt/jkr	Wiktionary	jkr	Koro (India)
Wp/jmx	Wikipedia	jmx	Western Juxtlahuaca Mixtec
Wp/jqr	Wikipedia	jqr	Jaqaru
Wp/jra	Wikipedia	jra	Jarai
Wp/jut	Wikipedia	jut	Jutish
Wt/jut	Wiktionary	jut	Jutish
Ws/jv	Wikisource	jv	Javanese
Wq/jv	Wikiquote	jv	Javanese
Wt/jv	Wiktionary	jv	Javanese
Wp/jv	Wikipedia	jv	Javanese
Wb/jv	Wikibooks	jv	Javanese
Wn/jv	Wikinews	jv	Javanese
Wp/jye	Wikipedia	jye	Judeo-Yemeni Arabic
Wt/ka	Wiktionary	ka	Georgian
Ws/ka	Wikisource	ka	Georgian
Wv/ka	Wikiversity	ka	Georgian
Wy/ka	Wikivoyage	ka	Georgian
Wq/ka	Wikiquote	ka	Georgian
Wn/ka	Wikinews	ka	Georgian
Wb/ka	Wikibooks	ka	Georgian
Wp/ka	Wikipedia	ka	Georgian
Wq/kaa	Wikiquote	kaa	Kara-Kalpak
Wt/kaa	Wiktionary	kaa	Kara-Kalpak
Wp/kaa	Wikipedia	kaa	Kara-Kalpak
Wn/kaa	Wikinews	kaa	Kara-Kalpak
Wy/kab	Wikivoyage	kab	Kabyle
Wt/kab	Wiktionary	kab	Kabyle
Wb/kab	Wikibooks	kab	Kabyle
Wp/kab	Wikipedia	kab	Kabyle
Wp/kac	Wikipedia	kac	Kachin
Wt/kac	Wiktionary	kac	Kachin
Wp/kai	Wikipedia	kai	Karekare
Wp/kaj	Wikipedia	kaj	Jju
Wp/kap	Wikipedia	kap	Bezhta
Wt/kbd	Wiktionary	kbd	Kabardian
Wp/kbd	Wikipedia	kbd	Kabardian
Wp/kbp	Wikipedia	kbp	Kabiye
Wp/kca	Wikipedia	kca	Khanty
Wp/kcg	Wikipedia	kcg	Tyap
Wq/kcg	Wikiquote	kcg	Tyap
Wt/kcg	Wiktionary	kcg	Tyap
Wp/kck	Wikipedia	kck	Kalanga
Wp/kdr	Wikipedia	kdr	Karaim
Wt/kea	Wiktionary	kea	Kabuverdianu
Wp/kea	Wikipedia	kea	Kabuverdianu
Wp/kei	Wikipedia	kei	Kei
Wp/kek	Wikipedia	kek	Kekchí
Wp/ket	Wikipedia	ket	Ket
Wt/ket	Wiktionary	ket	Ket
Wp/kev	Wikipedia	kev	Kanikkaran
Wp/kff	Wikipedia	kff	Koya
Wp/kfr	Wikipedia	kfr	Kachhi
Wp/kfs	Wikipedia	kfs	Bilaspuri
Wp/kg	Wikipedia	kg	Kongo
Wt/kg	Wiktionary	kg	Kongo
Wt/kge	Wiktionary	kge	Komering
Wq/kge	Wikiquote	kge	Komering
Wy/kge	Wikivoyage	kge	Komering
Wn/kge	Wikinews	kge	Komering
Wb/kge	Wikibooks	kge	Komering
Wp/kge	Wikipedia	kge	Komering
Wp/kgp	Wikipedia	kgp	Kaingang
Wp/kha	Wikipedia	kha	Khasi
Wp/khb	Wikipedia	khb	Lü
Wy/khw	Wikivoyage	khw	Khowar
Wt/khw	Wiktionary	khw	Khowar
Wq/khw	Wikiquote	khw	Khowar
Wp/khw	Wikipedia	khw	Khowar
Wn/khw	Wikinews	khw	Khowar
Wb/khw	Wikibooks	khw	Khowar
Wt/ki	Wiktionary	ki	Kikuyu
Wy/ki	Wikivoyage	ki	Kikuyu
Wp/ki	Wikipedia	ki	Kikuyu
Wp/kib	Wikipedia	kib	Koalib
Wp/kim	Wikipedia	kim	Karagas
Wp/kio	Wikipedia	kio	Kiowa
Wp/kip	Wikipedia	kip	Sheshi Kham
Wp/kiu	Wikipedia	kiu	Kirmanjki (individual language)
Wt/kiu	Wiktionary	kiu	Kirmanjki (individual language)
Wp/kj	Wikipedia	kj	Kuanyama
Wt/kjh	Wiktionary	kjh	Khakas
Wy/kjh	Wikivoyage	kjh	Khakas
Wp/kjh	Wikipedia	kjh	Khakas
Wb/kjh	Wikibooks	kjh	Khakas
Wp/kjj	Wikipedia	kjj	Khinalugh
Wp/kjp	Wikipedia	kjp	Pwo Eastern Karen
Wt/kjp	Wiktionary	kjp	Pwo Eastern Karen
Ws/kk	Wikisource	kk	Kazakh
Wt/kk	Wiktionary	kk	Kazakh
Wy/kk	Wikivoyage	kk	Kazakh
Wq/kk	Wikiquote	kk	Kazakh
Wb/kk	Wikibooks	kk	Kazakh
Wp/kk	Wikipedia	kk	Kazakh
Wp/kkl	Wikipedia	kkl	Kosarek Yale
Wp/kkv	Wikipedia	kkv	Kangean
Wp/kkw	Wikipedia	kkw	Teke-Kukuya
Wt/kl	Wiktionary	kl	Kalaallisut
Wp/kl	Wikipedia	kl	Kalaallisut
Wn/kl	Wikinews	kl	Kalaallisut
Wp/klb	Wikipedia	klb	Kiliwa
Wp/kli	Wikipedia	kli	Kalumpang
Wp/kln	Wikipedia	kln	Kalenjin
Wp/kls	Wikipedia	kls	Kalasha
Wt/km	Wiktionary	km	Khmer
Ws/km	Wikisource	km	Khmer
Wp/km	Wikipedia	km	Khmer
Wb/km	Wikibooks	km	Khmer
Wp/kmc	Wikipedia	kmc	Southern Dong
Wp/kmz	Wikipedia	kmz	Khorasani Turkish
Ws/kn	Wikisource	kn	Kannada
Wt/kn	Wiktionary	kn	Kannada
Wy/kn	Wikivoyage	kn	Kannada
Wq/kn	Wikiquote	kn	Kannada
Wn/kn	Wikinews	kn	Kannada
Wb/kn	Wikibooks	kn	Kannada
Wp/kn	Wikipedia	kn	Kannada
Wt/knc	Wiktionary	knc	Central Kanuri
Wq/knc	Wikiquote	knc	Central Kanuri
Wp/knc	Wikipedia	knc	Central Kanuri
Wp/kne	Wikipedia	kne	Kankanaey
Wt/kne	Wiktionary	kne	Kankanaey
Wp/knn	Wikipedia	knn	Konkani (individual language)
Wp/kns	Wikipedia	kns	Kensiu
Wp/knx	Wikipedia	knx	Kendayan
Wt/ko	Wiktionary	ko	Korean
Ws/ko	Wikisource	ko	Korean
Wy/ko	Wikivoyage	ko	Korean
Wv/ko	Wikiversity	ko	Korean
Wq/ko	Wikiquote	ko	Korean
Wb/ko	Wikibooks	ko	Korean
Wn/ko	Wikinews	ko	Korean
Wp/ko	Wikipedia	ko	Korean
Ws/koi	Wikisource	koi	Komi-Permyak
Wp/koi	Wikipedia	koi	Komi-Permyak
Wt/koi	Wiktionary	koi	Komi-Permyak
Wp/kpm	Wikipedia	kpm	Koho
Wp/kpy	Wikipedia	kpy	Koryak
Wp/kr	Wikipedia	kr	Kanuri
Wq/kr	Wikiquote	kr	Kanuri
Wp/krc	Wikipedia	krc	Karachay-Balkar
Wt/krc	Wiktionary	krc	Karachay-Balkar
Wy/kri	Wikivoyage	kri	Krio
Wt/kri	Wiktionary	kri	Krio
Wp/kri	Wikipedia	kri	Krio
Wp/krj	Wikipedia	krj	Kinaray-A
Wp/krl	Wikipedia	krl	Karelian
Ws/krl	Wikisource	krl	Karelian
Wt/krl	Wiktionary	krl	Karelian
Wp/kru	Wikipedia	kru	Kurukh
Wq/ks	Wikiquote	ks	Kashmiri
Wt/ks	Wiktionary	ks	Kashmiri
Wp/ks	Wikipedia	ks	Kashmiri
Wb/ks	Wikibooks	ks	Kashmiri
Wp/ksf	Wikipedia	ksf	Bafia
Wp/ksh	Wikipedia	ksh	Colognian
Wt/ksh	Wiktionary	ksh	Colognian
Wp/ksk	Wikipedia	ksk	Kansa
Wp/ksw	Wikipedia	ksw	S'gaw Karen
Wt/ksw	Wiktionary	ksw	S'gaw Karen
Wp/ktv	Wikipedia	ktv	Eastern Katu
Wp/ktz	Wikipedia	ktz	Juǀʼhoan
Wv/ku	Wikiversity	ku	Kurdish
Wt/ku	Wiktionary	ku	Kurdish
Ws/ku	Wikisource	ku	Kurdish
Wq/ku	Wikiquote	ku	Kurdish
Wp/ku	Wikipedia	ku	Kurdish
Wb/ku	Wikibooks	ku	Kurdish
Wn/ku	Wikinews	ku	Kurdish
Wp/kum	Wikipedia	kum	Kumyk
Wp/kus	Wikipedia	kus	Kusaal
Wp/kut	Wikipedia	kut	Kutenai
Wt/kut	Wiktionary	kut	Kutenai
Wp/kv	Wikipedia	kv	Komi
Wp/kvr	Wikipedia	kvr	Kerinci
Wp/kvv	Wikipedia	kvv	Kola
Wt/kw	Wiktionary	kw	Cornish
Ws/kw	Wikisource	kw	Cornish
Wq/kw	Wikiquote	kw	Cornish
Wp/kw	Wikipedia	kw	Cornish
Wp/kwh	Wikipedia	kwh	Kowiai
Wp/kww	Wikipedia	kww	Kwinti
Wp/kxd	Wikipedia	kxd	Brunei
Ws/ky	Wikisource	ky	Kyrgyz
Wt/ky	Wiktionary	ky	Kyrgyz
Wy/ky	Wikivoyage	ky	Kyrgyz
Wq/ky	Wikiquote	ky	Kyrgyz
Wp/ky	Wikipedia	ky	Kyrgyz
Wn/ky	Wikinews	ky	Kyrgyz
Wb/ky	Wikibooks	ky	Kyrgyz
Wp/kyu	Wikipedia	kyu	Western Kayah
Wp/kzg	Wikipedia	kzg	Kikai
Wp/kzp	Wikipedia	kzp	Kaidipang
Wy/la	Wikivoyage	la	Latin
Wt/la	Wiktionary	la	Latin
Wv/la	Wikiversity	la	Latin
Ws/la	Wikisource	la	Latin
Wb/la	Wikibooks	la	Latin
Wp/la	Wikipedia	la	Latin
Wq/la	Wikiquote	la	Latin
Wt/lad	Wiktionary	lad	Ladino
Ws/lad	Wikisource	lad	Ladino
Wp/lad	Wikipedia	lad	Ladino
Wb/lad	Wikibooks	lad	Ladino
Wn/lad	Wikinews	lad	Ladino
Wp/lae	Wikipedia	lae	Pattani
Wt/lag	Wiktionary	lag	Rangi
Wp/lah	Wikipedia	lah	Lahnda
Wp/lai	Wikipedia	lai	Lambya
Wy/lb	Wikivoyage	lb	Luxembourgish
Wt/lb	Wiktionary	lb	Luxembourgish
Ws/lb	Wikisource	lb	Luxembourgish
Wq/lb	Wikiquote	lb	Luxembourgish
Wp/lb	Wikipedia	lb	Luxembourgish
Wb/lb	Wikibooks	lb	Luxembourgish
Wt/lbe	Wiktionary	lbe	Lak
Wp/lbe	Wikipedia	lbe	Lak
Wp/lbj	Wikipedia	lbj	Ladakhi
Wp/lbw	Wikipedia	lbw	Tolaki
Wp/lbx	Wikipedia	lbx	Lawangan
Ws/ldn	Wikisource	ldn	Láadan
Wp/ldn	Wikipedia	ldn	Láadan
Wp/lep	Wikipedia	lep	Lepcha
Wp/lew	Wikipedia	lew	Ledo Kaili
Wp/lez	Wikipedia	lez	Lezghian
Wt/lez	Wiktionary	lez	Lezghian
Wp/lfn	Wikipedia	lfn	Lingua Franca Nova
Wt/lfn	Wiktionary	lfn	Lingua Franca Nova
Wp/lg	Wikipedia	lg	Ganda
Ws/lg	Wikisource	lg	Ganda
Wt/lg	Wiktionary	lg	Ganda
Wt/lgg	Wiktionary	lgg	Lugbara
Wp/lgg	Wikipedia	lgg	Lugbara
Wp/lhu	Wikipedia	lhu	Lahu
Wq/li	Wikiquote	li	Limburgish
Ws/li	Wikisource	li	Limburgish
Wt/li	Wiktionary	li	Limburgish
Wy/li	Wikivoyage	li	Limburgish
Wp/li	Wikipedia	li	Limburgish
Wb/li	Wikibooks	li	Limburgish
Wn/li	Wikinews	li	Limburgish
Wp/lic	Wikipedia	lic	Hlai
Wp/lif	Wikipedia	lif	Limbu
Wt/lij	Wiktionary	lij	Ligurian
Ws/lij	Wikisource	lij	Ligurian
Wp/lij	Wikipedia	lij	Ligurian
Wp/lis	Wikipedia	lis	Lisu
Wp/liv	Wikipedia	liv	Liv
Ws/liv	Wikisource	liv	Liv
Wp/ljp	Wikipedia	ljp	Lampung Api
Wt/ljp	Wiktionary	ljp	Lampung Api
Wb/lki	Wikibooks	lki	Laki
Wp/lki	Wikipedia	lki	Laki
Wt/lki	Wiktionary	lki	Laki
Wp/lkt	Wikipedia	lkt	Lakota
Ws/lld	Wikisource	lld	Ladin
Wp/lld	Wikipedia	lld	Ladin
Wn/lmo	Wikinews	lmo	Lombard
Wp/lmo	Wikipedia	lmo	Lombard
Ws/lmo	Wikisource	lmo	Lombard
Wt/lmo	Wiktionary	lmo	Lombard
Wt/ln	Wiktionary	ln	Lingala
Ws/ln	Wikisource	ln	Lingala
Wp/ln	Wikipedia	ln	Lingala
Wb/ln	Wikibooks	ln	Lingala
Ws/lo	Wikisource	lo	Lao
Wy/lo	Wikivoyage	lo	Lao
Wt/lo	Wiktionary	lo	Lao
Wp/lo	Wikipedia	lo	Lao
Wn/lo	Wikinews	lo	Lao
Wp/lon	Wikipedia	lon	Malawi Lomwe
Wp/lou	Wikipedia	lou	Louisiana Creole
Wp/loz	Wikipedia	loz	Lozi
Wt/loz	Wiktionary	loz	Lozi
Wp/lpo	Wikipedia	lpo	Lipo
Ws/lra	Wikisource	lra	Rara Bakati'
Wp/lrc	Wikipedia	lrc	Northern Luri
Wt/lrc	Wiktionary	lrc	Northern Luri
Wp/lrl	Wikipedia	lrl	Lari
Ws/lt	Wikisource	lt	Lithuanian
Wt/lt	Wiktionary	lt	Lithuanian
Wv/lt	Wikiversity	lt	Lithuanian
Wy/lt	Wikivoyage	lt	Lithuanian
Wq/lt	Wikiquote	lt	Lithuanian
Wb/lt	Wikibooks	lt	Lithuanian
Wn/lt	Wikinews	lt	Lithuanian
Wp/lt	Wikipedia	lt	Lithuanian
Wt/ltg	Wiktionary	ltg	Latgalian
Wp/ltg	Wikipedia	ltg	Latgalian
Wp/lu	Wikipedia	lu	Luba-Katanga
Wp/lua	Wikipedia	lua	Luba-Lulua
Wp/lue	Wikipedia	lue	Luvale
Wp/luo	Wikipedia	luo	Luo (Kenya and Tanzania)
Wp/lus	Wikipedia	lus	Lushai
Wt/lus	Wiktionary	lus	Lushai
Wp/lut	Wikipedia	lut	Lushootseed
Wp/luz	Wikipedia	luz	Southern Luri
Wt/luz	Wiktionary	luz	Southern Luri
Wt/lv	Wiktionary	lv	Latvian
Ws/lv	Wikisource	lv	Latvian
Wv/lv	Wikiversity	lv	Latvian
Wy/lv	Wikivoyage	lv	Latvian
Wq/lv	Wikiquote	lv	Latvian
Wn/lv	Wikinews	lv	Latvian
Wb/lv	Wikibooks	lv	Latvian
Wp/lv	Wikipedia	lv	Latvian
Wt/lvk	Wiktionary	lvk	Lavukaleve
Wn/lvk	Wikinews	lvk	Lavukaleve
Wb/lzh	Wikibooks	lzh	Literary Chinese
Wq/lzh	Wikiquote	lzh	Literary Chinese
Ws/lzh	Wikisource	lzh	Literary Chinese
Wy/lzh	Wikivoyage	lzh	Literary Chinese
Wt/lzz	Wiktionary	lzz	Laz
Wp/lzz	Wikipedia	lzz	Laz
Wp/mad	Wikipedia	mad	Madurese
Wt/mad	Wiktionary	mad	Madurese
Wp/mag	Wikipedia	mag	Magahi
Wq/mag	Wikiquote	mag	Magahi
Wt/mag	Wiktionary	mag	Magahi
Wy/mai	Wikivoyage	mai	Maithili
Wt/mai	Wiktionary	mai	Maithili
Wp/mai	Wikipedia	mai	Maithili
Wp/mak	Wikipedia	mak	Makasar
Wp/mam	Wikipedia	mam	Mam
Wp/map-bms	Wikipedia	map-bms	Banyumasan
Ws/mas	Wikisource	mas	Masai
Wp/mau	Wikipedia	mau	Huautla Mazatec
Wp/max	Wikipedia	max	North Moluccan Malay
Wp/maz	Wikipedia	maz	Central Mazahua
Wp/mbb	Wikipedia	mbb	Western Bukidnon Manobo
Wp/mbc	Wikipedia	mbc	Macushi
Wp/mdf	Wikipedia	mdf	Moksha
Ws/mdf	Wikisource	mdf	Moksha
Wt/mdf	Wiktionary	mdf	Moksha
Wp/mdh	Wikipedia	mdh	Maguindanaon
Wp/mdr	Wikipedia	mdr	Mandar
Wt/med	Wiktionary	med	Melpa
Wp/meo	Wikipedia	meo	Kedah Malay
Wt/meu	Wiktionary	meu	Motu
Wp/meu	Wikipedia	meu	Motu
Wp/mey	Wikipedia	mey	Hassaniyya
Wt/mey	Wiktionary	mey	Hassaniyya
Wp/mfa	Wikipedia	mfa	Pattani Malay
Wt/mfa	Wiktionary	mfa	Pattani Malay
Wp/mfb	Wikipedia	mfb	Bangka
Wp/mfe	Wikipedia	mfe	Morisyen
Wp/mfp	Wikipedia	mfp	Makassar Malay
Wp/mfy	Wikipedia	mfy	Mayo
Wy/mg	Wikivoyage	mg	Malagasy
Wt/mg	Wiktionary	mg	Malagasy
Ws/mg	Wikisource	mg	Malagasy
Wb/mg	Wikibooks	mg	Malagasy
Wp/mg	Wikipedia	mg	Malagasy
Wn/mg	Wikinews	mg	Malagasy
Wp/mgp	Wikipedia	mgp	Eastern Magar
Wt/mh	Wiktionary	mh	Marshallese
Wp/mh	Wikipedia	mh	Marshallese
Wp/mhp	Wikipedia	mhp	Balinese Malay
Wp/mhr	Wikipedia	mhr	Eastern Mari
Ws/mhr	Wikisource	mhr	Eastern Mari
Wt/mhr	Wiktionary	mhr	Eastern Mari
Wp/mhy	Wikipedia	mhy	Ma'anyan
Wy/mi	Wikivoyage	mi	Māori
Wt/mi	Wiktionary	mi	Māori
Ws/mi	Wikisource	mi	Māori
Wp/mi	Wikipedia	mi	Māori
Wb/mi	Wikibooks	mi	Māori
Wp/mic	Wikipedia	mic	Mi'kmaq
Wp/mid	Wikipedia	mid	Mandaic
Wp/min	Wikipedia	min	Minangkabau
Wq/min	Wikiquote	min	Minangkabau
Wt/min	Wiktionary	min	Minangkabau
Wn/min	Wikinews	min	Minangkabau
Wb/min	Wikibooks	min	Minangkabau
Wp/miq	Wikipedia	miq	Mískito
Wp/miz	Wikipedia	miz	Coatzospan Mixtec
Wp/mjd	Wikipedia	mjd	Northwest Maidu
Wp/mjw	Wikipedia	mjw	Karbi
Wp/mjx	Wikipedia	mjx	Mahali
Wp/mjy	Wikipedia	mjy	Mahican
Wy/mk	Wikivoyage	mk	Macedonian
Wt/mk	Wiktionary	mk	Macedonian
Ws/mk	Wikisource	mk	Macedonian
Wq/mk	Wikiquote	mk	Macedonian
Wb/mk	Wikibooks	mk	Macedonian
Wn/mk	Wikinews	mk	Macedonian
Wp/mk	Wikipedia	mk	Macedonian
Wt/mkn	Wiktionary	mkn	Kupang Malay
Wn/mkn	Wikinews	mkn	Kupang Malay
Wp/mkn	Wikipedia	mkn	Kupang Malay
Wp/mkw	Wikipedia	mkw	Kituba (Congo)
Wy/ml	Wikivoyage	ml	Malayalam
Ws/ml	Wikisource	ml	Malayalam
Wt/ml	Wiktionary	ml	Malayalam
Wv/ml	Wikiversity	ml	Malayalam
Wp/ml	Wikipedia	ml	Malayalam
Wq/ml	Wikiquote	ml	Malayalam
Wb/ml	Wikibooks	ml	Malayalam
Wn/ml	Wikinews	ml	Malayalam
Wq/mn	Wikiquote	mn	Mongolian
Wy/mn	Wikivoyage	mn	Mongolian
Wt/mn	Wiktionary	mn	Mongolian
Wp/mn	Wikipedia	mn	Mongolian
Wn/mn	Wikinews	mn	Mongolian
Wb/mn	Wikibooks	mn	Mongolian
Wp/mnb	Wikipedia	mnb	Muna
Wt/mnc	Wiktionary	mnc	Manchu
Ws/mnc	Wikisource	mnc	Manchu
Wq/mnc	Wikiquote	mnc	Manchu
Wp/mnc	Wikipedia	mnc	Manchu
Wb/mnc	Wikibooks	mnc	Manchu
Wq/mni	Wikiquote	mni	Manipuri
Wy/mni	Wikivoyage	mni	Manipuri
Wt/mni	Wiktionary	mni	Manipuri
Wb/mni	Wikibooks	mni	Manipuri
Wp/mni	Wikipedia	mni	Manipuri
Wn/mni	Wikinews	mni	Manipuri
Wp/mnk	Wikipedia	mnk	Mandinka
Wp/mnp	Wikipedia	mnp	Min Bei Chinese
Ws/mnp	Wikisource	mnp	Min Bei Chinese
Wt/mnp	Wiktionary	mnp	Min Bei Chinese
Wp/mnq	Wikipedia	mnq	Minriq
Wt/mns	Wiktionary	mns	Mansi
Wp/mns	Wikipedia	mns	Mansi
Wy/mnw	Wikivoyage	mnw	Mon
Wt/mnw	Wiktionary	mnw	Mon
Wq/mnw	Wikiquote	mnw	Mon
Wb/mnw	Wikibooks	mnw	Mon
Wp/mnw	Wikipedia	mnw	Mon
Wp/moe	Wikipedia	moe	Innu
Wp/mog	Wikipedia	mog	Mongondow
Wp/moh	Wikipedia	moh	Mohawk
Wp/mor	Wikipedia	mor	Moro
Wp/mos	Wikipedia	mos	Mossi
Wb/mos	Wikibooks	mos	Mossi
Wp/mpm	Wikipedia	mpm	Yosondúa Mixtec
Wp/mqg	Wikipedia	mqg	Kota Bangun Kutai Malay
Wp/mqm	Wikipedia	mqm	South Marquesan
Wq/mr	Wikiquote	mr	Marathi
Ws/mr	Wikisource	mr	Marathi
Wy/mr	Wikivoyage	mr	Marathi
Wt/mr	Wiktionary	mr	Marathi
Wb/mr	Wikibooks	mr	Marathi
Wn/mr	Wikinews	mr	Marathi
Wp/mr	Wikipedia	mr	Marathi
Wb/mrh	Wikibooks	mrh	Mara Chin
Wp/mrh	Wikipedia	mrh	Mara Chin
Wt/mrh	Wiktionary	mrh	Mara Chin
Ws/mrj	Wikisource	mrj	Western Mari
Wp/mrj	Wikipedia	mrj	Western Mari
Wp/mro	Wikipedia	mro	Mru
Wp/mrq	Wikipedia	mrq	North Marquesan
Wp/mrt	Wikipedia	mrt	Marghi Central
Wp/mrv	Wikipedia	mrv	Mangareva
Wp/mrw	Wikipedia	mrw	Maranao
Wt/ms	Wiktionary	ms	Malay
Ws/ms	Wikisource	ms	Malay
Wq/ms	Wikiquote	ms	Malay
Wy/ms	Wikivoyage	ms	Malay
Wb/ms	Wikibooks	ms	Malay
Wn/ms	Wikinews	ms	Malay
Wp/ms	Wikipedia	ms	Malay
Wt/mt	Wiktionary	mt	Maltese
Wy/mt	Wikivoyage	mt	Maltese
Ws/mt	Wikisource	mt	Maltese
Wq/mt	Wikiquote	mt	Maltese
Wp/mt	Wikipedia	mt	Maltese
Wp/mtl	Wikipedia	mtl	Montol
Wp/mto	Wikipedia	mto	Totontepec Mixe
Wp/mtq	Wikipedia	mtq	Muong
Wp/mua	Wikipedia	mua	Mundang
Wt/mue	Wiktionary	mue	Media Lengua
Wt/mui	Wiktionary	mui	Musi
Wp/mui	Wikipedia	mui	Musi
Wp/mus	Wikipedia	mus	Muscogee
Wt/mus	Wiktionary	mus	Muscogee
Wp/mvf	Wikipedia	mvf	Peripheral Mongolian
Wq/mvf	Wikiquote	mvf	Peripheral Mongolian
Wp/mvi	Wikipedia	mvi	Miyako
Wp/mwl	Wikipedia	mwl	Mirandese
Ws/mwl	Wikisource	mwl	Mirandese
Wt/mwl	Wiktionary	mwl	Mirandese
Wv/mwl	Wikiversity	mwl	Mirandese
Wp/mwp	Wikipedia	mwp	Kala Lagaw Ya
Wp/mwv	Wikipedia	mwv	Mentawai
Wp/mww	Wikipedia	mww	Hmong Daw
Wt/mxi	Wiktionary	mxi	Mozarabic
Wp/mxp	Wikipedia	mxp	Tlahuitoltepec Mixe
Wp/mxt	Wikipedia	mxt	Jamiltepec Mixtec
Ws/my	Wikisource	my	Burmese
Wy/my	Wikivoyage	my	Burmese
Wt/my	Wiktionary	my	Burmese
Wq/my	Wikiquote	my	Burmese
Wb/my	Wikibooks	my	Burmese
Wp/my	Wikipedia	my	Burmese
Wt/myv	Wiktionary	myv	Erzya
Ws/myv	Wikisource	myv	Erzya
Wp/myv	Wikipedia	myv	Erzya
Wn/myv	Wikinews	myv	Erzya
Ws/mzn	Wikisource	mzn	Mazanderani
Wv/mzn	Wikiversity	mzn	Mazanderani
Wt/mzn	Wiktionary	mzn	Mazanderani
Wq/mzn	Wikiquote	mzn	Mazanderani
Wb/mzn	Wikibooks	mzn	Mazanderani
Wp/mzn	Wikipedia	mzn	Mazanderani
Wn/mzn	Wikinews	mzn	Mazanderani
Wp/mzs	Wikipedia	mzs	Macanese
Wq/na	Wikiquote	na	Nauru
Wt/na	Wiktionary	na	Nauru
Wb/na	Wikibooks	na	Nauru
Wp/na	Wikipedia	na	Nauru
Wt/nah	Wiktionary	nah	Nahuatl
Ws/nah	Wikisource	nah	Nahuatl
Wp/nah	Wikipedia	nah	Nahuatl
Wb/nah	Wikibooks	nah	Nahuatl
Ws/nan	Wikisource	nan	Minnan
Wq/nan	Wikiquote	nan	Minnan
Wt/nan	Wiktionary	nan	Minnan
Wp/nan	Wikipedia	nan	Minnan
Wb/nan	Wikibooks	nan	Minnan
Wn/nan	Wikinews	nan	Minnan
Ws/nap	Wikisource	nap	Neapolitan
Wy/nap	Wikivoyage	nap	Neapolitan
Wt/nap	Wiktionary	nap	Neapolitan
Wq/nap	Wikiquote	nap	Neapolitan
Wp/nap	Wikipedia	nap	Neapolitan
Wn/nap	Wikinews	nap	Neapolitan
Wb/nap	Wikibooks	nap	Neapolitan
Wp/naq	Wikipedia	naq	Khoekhoe
Wy/nb	Wikivoyage	nb	Norwegian Bokmål
Wp/nch	Wikipedia	nch	Central Huasteca Nahuatl
Wp/nci	Wikipedia	nci	Classical Nahuatl
Wp/ncj	Wikipedia	ncj	Northern Puebla Nahuatl
Wp/ncl	Wikipedia	ncl	Michoacán Nahuatl
Wp/nd	Wikipedia	nd	North Ndebele
Ws/nds	Wikisource	nds	Low German
Wq/nds	Wikiquote	nds	Low German
Wt/nds	Wiktionary	nds	Low German
Wp/nds	Wikipedia	nds	Low German
Wb/nds	Wikibooks	nds	Low German
Wp/nds-nl	Wikipedia	nds-nl	Low Saxon
Ws/ne	Wikisource	ne	Nepali
Wt/ne	Wiktionary	ne	Nepali
Wv/ne	Wikiversity	ne	Nepali
Wy/ne	Wikivoyage	ne	Nepali
Wq/ne	Wikiquote	ne	Nepali
Wb/ne	Wikibooks	ne	Nepali
Wn/ne	Wikinews	ne	Nepali
Wp/ne	Wikipedia	ne	Nepali
Wp/neg	Wikipedia	neg	Negidal
Wt/neg	Wiktionary	neg	Negidal
Wp/neq	Wikipedia	neq	North Central Mixe
Wt/new	Wiktionary	new	Newari
Wp/new	Wikipedia	new	Newari
Wn/new	Wikinews	new	Newari
Wp/ng	Wikipedia	ng	Ndonga
Ws/ng	Wikisource	ng	Ndonga
Wt/ng	Wiktionary	ng	Ndonga
Wp/ngh	Wikipedia	ngh	Nǁng
Wt/ngh	Wiktionary	ngh	Nǁng
Wp/ngu	Wikipedia	ngu	Guerrero Nahuatl
Wp/nhe	Wikipedia	nhe	Eastern Huasteca Nahuatl
Wp/nhn	Wikipedia	nhn	Central Nahuatl
Wp/nia	Wikipedia	nia	Nias
Wq/nia	Wikiquote	nia	Nias
Wt/nia	Wiktionary	nia	Nias
Wb/nia	Wikibooks	nia	Nias
Wn/nia	Wikinews	nia	Nias
Wp/nij	Wikipedia	nij	Ngaju
Wt/nij	Wiktionary	nij	Ngaju
Wp/niq	Wikipedia	niq	Nandi
Wp/nit	Wikipedia	nit	Southeastern Kolami
Wb/nit	Wikibooks	nit	Southeastern Kolami
Wp/niu	Wikipedia	niu	Niuean
Wp/niv	Wikipedia	niv	Gilyak
Wp/njo	Wikipedia	njo	Ao Naga
Wp/njr	Wikipedia	njr	Njerep
Wt/nl	Wiktionary	nl	Dutch
Ws/nl	Wikisource	nl	Dutch
Wv/nl	Wikiversity	nl	Dutch
Wy/nl	Wikivoyage	nl	Dutch
Wn/nl	Wikinews	nl	Dutch
Wq/nl	Wikiquote	nl	Dutch
Wb/nl	Wikibooks	nl	Dutch
Wp/nl	Wikipedia	nl	Dutch
Wp/nlv	Wikipedia	nlv	Orizaba Nahuatl
Wp/nmg	Wikipedia	nmg	Kwasio
Wp/nmz	Wikipedia	nmz	Nawdm
Wq/nn	Wikiquote	nn	Norwegian Nynorsk
Wt/nn	Wiktionary	nn	Norwegian Nynorsk
Wp/nn	Wikipedia	nn	Norwegian Nynorsk
Wp/nnp	Wikipedia	nnp	Wancho Naga
Wq/no	Wikiquote	no	Norwegian
Ws/no	Wikisource	no	Norwegian
Wt/no	Wiktionary	no	Norwegian
Wv/no	Wikiversity	no	Norwegian
Wb/no	Wikibooks	no	Norwegian
Wn/no	Wikinews	no	Norwegian
Wp/no	Wikipedia	no	Norwegian
Wp/nod	Wikipedia	nod	Northern Thai
Ws/nod	Wikisource	nod	Northern Thai
Wp/nog	Wikipedia	nog	Nogai
Ws/non	Wikisource	non	Old Norse
Wp/non	Wikipedia	non	Old Norse
Wp/nov	Wikipedia	nov	Novial
Wt/nov	Wiktionary	nov	Novial
Wp/nqo	Wikipedia	nqo	N’Ko
Wq/nqo	Wikiquote	nqo	N’Ko
Wp/nr	Wikipedia	nr	South Ndebele
Wb/nrm	Wikibooks	nrm	Norman
Wp/nrm	Wikipedia	nrm	Norman
Wt/nrm	Wiktionary	nrm	Norman
Ws/nrn	Wikisource	nrn	Norn
Wt/nso	Wiktionary	nso	Northern Sotho
Wb/nso	Wikibooks	nso	Northern Sotho
Wp/nso	Wikipedia	nso	Northern Sotho
Wp/nst	Wikipedia	nst	Tase Naga
Wp/num	Wikipedia	num	Niuafo'ou
Wp/nun	Wikipedia	nun	Anong
Wp/nup	Wikipedia	nup	Nupe-Nupe-Tako
Wp/nus	Wikipedia	nus	Nuer
Wt/nus	Wiktionary	nus	Nuer
Ws/nv	Wikisource	nv	Navajo
Wp/nv	Wikipedia	nv	Navajo
Wp/nxq	Wikipedia	nxq	Naxi
Wt/ny	Wiktionary	ny	Nyanja
Wp/ny	Wikipedia	ny	Nyanja
Wp/nyn	Wikipedia	nyn	Nyankole
Wp/nys	Wikipedia	nys	Nyungar
Wt/nys	Wiktionary	nys	Nyungar
Wp/nzi	Wikipedia	nzi	Nzima
Wp/oaa	Wikipedia	oaa	Orok
Wt/oaa	Wiktionary	oaa	Orok
Wp/oac	Wikipedia	oac	Oroch
Wt/oac	Wiktionary	oac	Oroch
Ws/oc	Wikisource	oc	Occitan
Wt/oc	Wiktionary	oc	Occitan
Wq/oc	Wikiquote	oc	Occitan
Wp/oc	Wikipedia	oc	Occitan
Wn/oc	Wikinews	oc	Occitan
Wb/oc	Wikibooks	oc	Occitan
Wp/oge	Wikipedia	oge	Old Georgian
Wp/oj	Wikipedia	oj	Ojibwa
Wp/ojb	Wikipedia	ojb	Northwestern Ojibwa
Wp/ojp	Wikipedia	ojp	Old Japanese
Wp/ojs	Wikipedia	ojs	Severn Ojibwa
Wp/oka	Wikipedia	oka	Okanagan
Wp/okn	Wikipedia	okn	Oki-No-Erabu
Wp/olo	Wikipedia	olo	Livvi-Karelian
Ws/olo	Wikisource	olo	Livvi-Karelian
Wt/olo	Wiktionary	olo	Livvi-Karelian
Wq/om	Wikiquote	om	Oromo
Wp/om	Wikipedia	om	Oromo
Wt/om	Wiktionary	om	Oromo
Wn/om	Wikinews	om	Oromo
Wb/om	Wikibooks	om	Oromo
Wp/oma	Wikipedia	oma	Omaha-Ponca
Wp/omc	Wikipedia	omc	Mochica
Wp/omp	Wikipedia	omp	Old Manipuri
Wp/ood	Wikipedia	ood	Tohono O'odham
Wp/opt	Wikipedia	opt	Opata
Wy/or	Wikivoyage	or	Odia
Wt/or	Wiktionary	or	Odia
Ws/or	Wikisource	or	Odia
Wq/or	Wikiquote	or	Odia
Wp/or	Wikipedia	or	Odia
Wb/or	Wikibooks	or	Odia
Wn/or	Wikinews	or	Odia
Wp/orh	Wikipedia	orh	Oroqen
Wt/orh	Wiktionary	orh	Oroqen
Wb/os	Wikibooks	os	Ossetic
Wn/os	Wikinews	os	Ossetic
Wp/os	Wikipedia	os	Ossetic
Wt/os	Wiktionary	os	Ossetic
Wp/osi	Wikipedia	osi	Osing
Ws/ota	Wikisource	ota	Ottoman Turkish (1500-1928)
Wp/otd	Wikipedia	otd	Ot Danum
Wp/ote	Wikipedia	ote	Mezquital Otomi
Ws/otk	Wikisource	otk	Old Turkish
Wp/otq	Wikipedia	otq	Querétaro Otomi
Wp/ovd	Wikipedia	ovd	Elfdalian
Ws/pa	Wikisource	pa	Punjabi
Wy/pa	Wikivoyage	pa	Punjabi
Wt/pa	Wiktionary	pa	Punjabi
Wv/pa	Wikiversity	pa	Punjabi
Wp/pa	Wikipedia	pa	Punjabi
Wq/pa	Wikiquote	pa	Punjabi
Wb/pa	Wikibooks	pa	Punjabi
Wn/pa	Wikinews	pa	Punjabi
Wp/pag	Wikipedia	pag	Pangasinan
Wt/pag	Wiktionary	pag	Pangasinan
Wb/pag	Wikibooks	pag	Pangasinan
Wt/pal	Wiktionary	pal	Pahlavi
Wp/pam	Wikipedia	pam	Pampanga
Wt/pam	Wiktionary	pam	Pampanga
Wp/pap	Wikipedia	pap	Papiamento
Wt/pap	Wiktionary	pap	Papiamento
Wp/par	Wikipedia	par	Panamint
Ws/pau	Wikisource	pau	Palauan
Wp/pau	Wikipedia	pau	Palauan
Wp/paw	Wikipedia	paw	Pawnee
Wp/pbb	Wikipedia	pbb	Páez
Wp/pcc	Wikipedia	pcc	Bouyei
Wb/pcd	Wikibooks	pcd	Picard
Wp/pcd	Wikipedia	pcd	Picard
Ws/pcd	Wikisource	pcd	Picard
Wt/pcd	Wiktionary	pcd	Picard
Wp/pck	Wikipedia	pck	Paite Chin
Wp/pcm	Wikipedia	pcm	Nigerian Pidgin
Wt/pcm	Wiktionary	pcm	Nigerian Pidgin
Wp/pdc	Wikipedia	pdc	Pennsylvania German
Wt/pdc	Wiktionary	pdc	Pennsylvania German
Wp/pdt	Wikipedia	pdt	Plautdietsch
Wp/pea	Wikipedia	pea	Peranakan Indonesian
Wp/pey	Wikipedia	pey	Petjo
Wp/pfl	Wikipedia	pfl	Palatine German
Wp/phl	Wikipedia	phl	Phalura
Wn/phr	Wikinews	phr	Pahari-Potwari
Wp/phr	Wikipedia	phr	Pahari-Potwari
Wp/pi	Wikipedia	pi	Pali
Ws/pi	Wikisource	pi	Pali
Wt/pi	Wiktionary	pi	Pali
Wp/pih	Wikipedia	pih	Norfuk-Pitkern
Wt/pih	Wiktionary	pih	Norfuk-Pitkern
Wp/pis	Wikipedia	pis	Pijin
Wt/pjt	Wiktionary	pjt	Pitjantjatjara
Wp/pjt	Wikipedia	pjt	Pitjantjatjara
Wp/pko	Wikipedia	pko	Pökoot
Ws/pl	Wikisource	pl	Polish
Wt/pl	Wiktionary	pl	Polish
Wv/pl	Wikiversity	pl	Polish
Wy/pl	Wikivoyage	pl	Polish
Wq/pl	Wikiquote	pl	Polish
Wb/pl	Wikibooks	pl	Polish
Wn/pl	Wikinews	pl	Polish
Wp/pl	Wikipedia	pl	Polish
Wp/pln	Wikipedia	pln	Palenquero
Wp/pmf	Wikipedia	pmf	Pamona
Wt/pms	Wiktionary	pms	Piedmontese
Ws/pms	Wikisource	pms	Piedmontese
Wp/pms	Wikipedia	pms	Piedmontese
Wp/pmy	Wikipedia	pmy	Papuan Malay
Wt/pmy	Wiktionary	pmy	Papuan Malay
Ws/pnb	Wikisource	pnb	Western Punjabi
Wt/pnb	Wiktionary	pnb	Western Punjabi
Wy/pnb	Wikivoyage	pnb	Western Punjabi
Wq/pnb	Wikiquote	pnb	Western Punjabi
Wb/pnb	Wikibooks	pnb	Western Punjabi
Wn/pnb	Wikinews	pnb	Western Punjabi
Wp/pnb	Wikipedia	pnb	Western Punjabi
Wp/pnt	Wikipedia	pnt	Pontic
Ws/pnt	Wikisource	pnt	Pontic
Wt/pnt	Wiktionary	pnt	Pontic
Wy/pnt	Wikivoyage	pnt	Pontic
Wt/pox	Wiktionary	pox	Polabian
Ws/pox	Wikisource	pox	Polabian
Wp/pox	Wikipedia	pox	Polabian
Wn/ppl	Wikinews	ppl	Pipil
Wp/ppl	Wikipedia	ppl	Pipil
Wp/prg	Wikipedia	prg	Prussian
Wt/prg	Wiktionary	prg	Prussian
Wp/prk	Wikipedia	prk	Parauk
Wt/ps	Wiktionary	ps	Pashto
Ws/ps	Wikisource	ps	Pashto
Wv/ps	Wikiversity	ps	Pashto
Wy/ps	Wikivoyage	ps	Pashto
Wb/ps	Wikibooks	ps	Pashto
Wq/ps	Wikiquote	ps	Pashto
Wn/ps	Wikinews	ps	Pashto
Wp/ps	Wikipedia	ps	Pashto
Wp/pse	Wikipedia	pse	Central Malay
Wy/pt	Wikivoyage	pt	Portuguese
Ws/pt	Wikisource	pt	Portuguese
Wt/pt	Wiktionary	pt	Portuguese
Wv/pt	Wikiversity	pt	Portuguese
Wq/pt	Wikiquote	pt	Portuguese
Wn/pt	Wikinews	pt	Portuguese
Wb/pt	Wikibooks	pt	Portuguese
Wp/pt	Wikipedia	pt	Portuguese
Wp/pua	Wikipedia	pua	Western Highland Purepecha
Wp/pwn	Wikipedia	pwn	Paiwan
Ws/pwn	Wikisource	pwn	Paiwan
Wt/pwn	Wiktionary	pwn	Paiwan
Wp/pwo	Wikipedia	pwo	Pwo Western Karen
Wp/pyu	Wikipedia	pyu	Puyuma
Wp/pzh	Wikipedia	pzh	Pazeh
Wt/pzh	Wiktionary	pzh	Pazeh
Ws/qu	Wikisource	qu	Quechua
Wt/qu	Wiktionary	qu	Quechua
Wq/qu	Wikiquote	qu	Quechua
Wp/qu	Wikipedia	qu	Quechua
Wb/qu	Wikibooks	qu	Quechua
Wp/qub	Wikipedia	qub	Huallaga Huánuco Quechua
Wt/qub	Wiktionary	qub	Huallaga Huánuco Quechua
Wp/quc	Wikipedia	quc	K'iche'
Wt/qug	Wiktionary	qug	Chimborazo Highland Quichua
Wp/qug	Wikipedia	qug	Chimborazo Highland Quichua
Wp/qux	Wikipedia	qux	Yauyos Quechua
Wp/qvc	Wikipedia	qvc	Cajamarca Quechua
Wp/qvm	Wikipedia	qvm	Margos-Yarowilca-Lauricocha Quechua
Wp/qvs	Wikipedia	qvs	San Martín Quechua
Wp/qvw	Wikipedia	qvw	Huaylla Wanca Quechua
Wb/qwh	Wikibooks	qwh	Huaylas Ancash Quechua
Wp/qwh	Wikipedia	qwh	Huaylas Ancash Quechua
Wt/qwh	Wiktionary	qwh	Huaylas Ancash Quechua
Wp/qxq	Wikipedia	qxq	Qashqa'i
Wp/rad	Wikipedia	rad	Rade
Wt/rad	Wiktionary	rad	Rade
Wp/rag	Wikipedia	rag	Logooli
Wp/raj	Wikipedia	raj	Rajasthani
Wb/rap	Wikibooks	rap	Rapanui
Wp/rap	Wikipedia	rap	Rapanui
Wt/rap	Wiktionary	rap	Rapanui
Wp/rar	Wikipedia	rar	Rarotongan
Wp/raw	Wikipedia	raw	Rawang
Wt/raw	Wiktionary	raw	Rawang
Wp/rbl	Wikipedia	rbl	Miraya Bikol
Wp/rcf	Wikipedia	rcf	Réunion Creole French
Wp/rej	Wikipedia	rej	Rejang
Wp/rgn	Wikipedia	rgn	Romagnol
Wt/rgn	Wiktionary	rgn	Romagnol
Wp/rhg	Wikipedia	rhg	Rohingya
Wp/rif	Wikipedia	rif	Tarifit
Wt/rif	Wiktionary	rif	Tarifit
Wp/rjs	Wikipedia	rjs	Rajbanshi
Wb/rjs	Wikibooks	rjs	Rajbanshi
Wb/rkt	Wikibooks	rkt	Rangpuri
Wn/rkt	Wikinews	rkt	Rangpuri
Wp/rkt	Wikipedia	rkt	Rangpuri
Wq/rkt	Wikiquote	rkt	Rangpuri
Wt/rkt	Wiktionary	rkt	Rangpuri
Wy/rkt	Wikivoyage	rkt	Rangpuri
Wt/rm	Wiktionary	rm	Romansh
Wp/rm	Wikipedia	rm	Romansh
Wb/rm	Wikibooks	rm	Romansh
Wp/rmc	Wikipedia	rmc	Carpathian Romani
Wt/rmc	Wiktionary	rmc	Carpathian Romani
Wp/rmf	Wikipedia	rmf	Kalo Finnish Romani
Wt/rmf	Wiktionary	rmf	Kalo Finnish Romani
Wt/rml	Wiktionary	rml	Baltic Romani
Ws/rml	Wikisource	rml	Baltic Romani
Wp/rml	Wikipedia	rml	Baltic Romani
Wq/rml	Wikiquote	rml	Baltic Romani
Wp/rmn	Wikipedia	rmn	Balkan Romani
Wt/rmq	Wiktionary	rmq	Caló
Wp/rms	Wikipedia	rms	Romanian Sign Language
Wp/rmy	Wikipedia	rmy	Vlax Romani
Wt/rmy	Wiktionary	rmy	Vlax Romani
Wp/rn	Wikipedia	rn	Rundi
Wt/rn	Wiktionary	rn	Rundi
Wt/ro	Wiktionary	ro	Romanian
Ws/ro	Wikisource	ro	Romanian
Wv/ro	Wikiversity	ro	Romanian
Wy/ro	Wikivoyage	ro	Romanian
Wn/ro	Wikinews	ro	Romanian
Wq/ro	Wikiquote	ro	Romanian
Wb/ro	Wikibooks	ro	Romanian
Wp/ro	Wikipedia	ro	Romanian
Wp/roa-tara	Wikipedia	roa-tara	Tarantino
Wt/roa-tara	Wiktionary	roa-tara	Tarantino
Wp/rob	Wikipedia	rob	Tae'
Wp/rop	Wikipedia	rop	Kriol
Wp/rsk	Wikipedia	rsk	Pannonian Rusyn
Wp/rtm	Wikipedia	rtm	Rotuman
Wy/ru	Wikivoyage	ru	Russian
Ws/ru	Wikisource	ru	Russian
Wt/ru	Wiktionary	ru	Russian
Wv/ru	Wikiversity	ru	Russian
Wp/ru	Wikipedia	ru	Russian
Wq/ru	Wikiquote	ru	Russian
Wb/ru	Wikibooks	ru	Russian
Wn/ru	Wikinews	ru	Russian
Wt/rue	Wiktionary	rue	Rusyn
Wy/rue	Wikivoyage	rue	Rusyn
Wp/rue	Wikipedia	rue	Rusyn
Wn/rue	Wikinews	rue	Rusyn
Wb/rue	Wikibooks	rue	Rusyn
Wp/ruo	Wikipedia	ruo	Istro Romanian
Ws/ruo	Wikisource	ruo	Istro Romanian
Wt/rup	Wiktionary	rup	Aromanian
Ws/rup	Wikisource	rup	Aromanian
Wp/rup	Wikipedia	rup	Aromanian
Wp/ruq	Wikipedia	ruq	Megleno Romanian
Wp/rut	Wikipedia	rut	Rutul
Wq/rw	Wikiquote	rw	Kinyarwanda
Wt/rw	Wiktionary	rw	Kinyarwanda
Wp/rw	Wikipedia	rw	Kinyarwanda
Wn/rw	Wikinews	rw	Kinyarwanda
Wp/rwr	Wikipedia	rwr	Marwari (India)
Wp/ryn	Wikipedia	ryn	Northern Amami-Oshima
Wp/rys	Wikipedia	rys	Yaeyama
Wy/ryu	Wikivoyage	ryu	Central Okinawan
Wt/ryu	Wiktionary	ryu	Central Okinawan
Wp/ryu	Wikipedia	ryu	Central Okinawan
Wb/ryu	Wikibooks	ryu	Central Okinawan
Ws/sa	Wikisource	sa	Sanskrit
Wt/sa	Wiktionary	sa	Sanskrit
Wq/sa	Wikiquote	sa	Sanskrit
Wb/sa	Wikibooks	sa	Sanskrit
Wp/sa	Wikipedia	sa	Sanskrit
Wt/sah	Wiktionary	sah	Yakut
Ws/sah	Wikisource	sah	Yakut
Wq/sah	Wikiquote	sah	Yakut
Wp/sah	Wikipedia	sah	Yakut
Wn/sah	Wikinews	sah	Yakut
Wp/sas	Wikipedia	sas	Sasak
Wq/sat	Wikiquote	sat	Santali
Wt/sat	Wiktionary	sat	Santali
Wy/sat	Wikivoyage	sat	Santali
Wp/sat	Wikipedia	sat	Santali
Wb/sat	Wikibooks	sat	Santali
Wn/sat	Wikinews	sat	Santali
Wp/saz	Wikipedia	saz	Saurashtra
Wt/saz	Wiktionary	saz	Saurashtra
Wt/sc	Wiktionary	sc	Sardinian
Ws/sc	Wikisource	sc	Sardinian
Wp/sc	Wikipedia	sc	Sardinian
Wp/scl	Wikipedia	scl	Shina
Wq/scn	Wikiquote	scn	Sicilian
Wt/scn	Wiktionary	scn	Sicilian
Wp/scn	Wikipedia	scn	Sicilian
Wn/scn	Wikinews	scn	Sicilian
Wb/scn	Wikibooks	scn	Sicilian
Wn/sco	Wikinews	sco	Scots
Wp/sco	Wikipedia	sco	Scots
Wv/sco	Wikiversity	sco	Scots
Wy/sd	Wikivoyage	sd	Sindhi
Wt/sd	Wiktionary	sd	Sindhi
Wq/sd	Wikiquote	sd	Sindhi
Wp/sd	Wikipedia	sd	Sindhi
Wn/sd	Wikinews	sd	Sindhi
Wb/sd	Wikibooks	sd	Sindhi
Wp/sda	Wikipedia	sda	Toraja-Sa'dan
Wp/sdb	Wikipedia	sdb	Shabak
Wp/sdc	Wikipedia	sdc	Sassarese Sardinian
Wp/sdh	Wikipedia	sdh	Southern Kurdish
Wp/sdo	Wikipedia	sdo	Bukar-Sadung Bidayuh
Wt/se	Wiktionary	se	Northern Sami
Ws/se	Wikisource	se	Northern Sami
Wq/se	Wikiquote	se	Northern Sami
Wn/se	Wikinews	se	Northern Sami
Wp/se	Wikipedia	se	Northern Sami
Wb/se	Wikibooks	se	Northern Sami
Wp/sea	Wikipedia	sea	Semai
Ws/see	Wikisource	see	Seneca
Wp/sei	Wikipedia	sei	Seri
Wp/sel	Wikipedia	sel	Selkup
Wp/ses	Wikipedia	ses	Koyraboro Senni Songhai
Wp/sez	Wikipedia	sez	Senthang Chin
Wt/sg	Wiktionary	sg	Sango
Wp/sg	Wikipedia	sg	Sango
Wp/sgc	Wikipedia	sgc	Kipsigis
Wp/sgd	Wikipedia	sgd	Surigaonon
Wp/sgh	Wikipedia	sgh	Shughni
Wp/sgj	Wikipedia	sgj	Surgujia
Wb/sgs	Wikibooks	sgs	Samogitian
Wp/sgs	Wikipedia	sgs	Samogitian
Wp/sgy	Wikipedia	sgy	Sanglechi
Wt/sh	Wiktionary	sh	Serbo-Croatian
Wq/sh	Wikiquote	sh	Serbo-Croatian
Wp/sh	Wikipedia	sh	Serbo-Croatian
Wp/sha	Wikipedia	sha	Shall-Zwall
Wp/she	Wikipedia	she	Sheko
Wp/shh	Wikipedia	shh	Shoshoni
Wp/shi	Wikipedia	shi	Tachelhit
Wt/shi	Wiktionary	shi	Tachelhit
Wy/shi	Wikivoyage	shi	Tachelhit
Wt/shn	Wiktionary	shn	Shan
Wp/shn	Wikipedia	shn	Shan
Wy/shn	Wikivoyage	shn	Shan
Wb/shn	Wikibooks	shn	Shan
Wn/shn	Wikinews	shn	Shan
Wp/shp	Wikipedia	shp	Shipibo-Conibo
Wp/shx	Wikipedia	shx	She
Wp/shy	Wikipedia	shy	Shawiya
Wt/shy	Wiktionary	shy	Shawiya
Ws/si	Wikisource	si	Sinhala
Wq/si	Wikiquote	si	Sinhala
Wt/si	Wiktionary	si	Sinhala
Wy/si	Wikivoyage	si	Sinhala
Wn/si	Wikinews	si	Sinhala
Wb/si	Wikibooks	si	Sinhala
Wp/si	Wikipedia	si	Sinhala
Ws/sia	Wikisource	sia	Akkala Sami
Wq/simple	Wikiquote	simple	Simple English
Wt/simple	Wiktionary	simple	Simple English
Wp/simple	Wikipedia	simple	Simple English
Wb/simple	Wikibooks	simple	Simple English
Wp/sip	Wikipedia	sip	Sikkimese
Wp/sjd	Wikipedia	sjd	Kildin Sami
Ws/sjd	Wikisource	sjd	Kildin Sami
Wp/sje	Wikipedia	sje	Pite Sami
Wp/sjo	Wikipedia	sjo	Xibe
Wp/sju	Wikipedia	sju	Ume Sami
Ws/sk	Wikisource	sk	Slovak
Wt/sk	Wiktionary	sk	Slovak
Wv/sk	Wikiversity	sk	Slovak
Wy/sk	Wikivoyage	sk	Slovak
Wq/sk	Wikiquote	sk	Slovak
Wb/sk	Wikibooks	sk	Slovak
Wn/sk	Wikinews	sk	Slovak
Wp/sk	Wikipedia	sk	Slovak
Wp/skh	Wikipedia	skh	Sikule
Wt/skr	Wiktionary	skr	Saraiki
Wq/skr	Wikiquote	skr	Saraiki
Wy/skr	Wikivoyage	skr	Saraiki
Wb/skr	Wikibooks	skr	Saraiki
Wp/skr	Wikipedia	skr	Saraiki
Wn/skr	Wikinews	skr	Saraiki
Wt/sl	Wiktionary	sl	Slovenian
Ws/sl	Wikisource	sl	Slovenian
Wv/sl	Wikiversity	sl	Slovenian
Wy/sl	Wikivoyage	sl	Slovenian
Wq/sl	Wikiquote	sl	Slovenian
Wb/sl	Wikibooks	sl	Slovenian
Wn/sl	Wikinews	sl	Slovenian
Wp/sl	Wikipedia	sl	Slovenian
Wp/sli	Wikipedia	sli	Lower Silesian
Wp/slr	Wikipedia	slr	Salar
Wp/sly	Wikipedia	sly	Selayar
Wt/sm	Wiktionary	sm	Samoan
Wp/sm	Wikipedia	sm	Samoan
Wt/sma	Wiktionary	sma	Southern Sami
Wp/sma	Wikipedia	sma	Southern Sami
Wb/sma	Wikibooks	sma	Southern Sami
Wp/smj	Wikipedia	smj	Lule Sami
Wt/smj	Wiktionary	smj	Lule Sami
Wp/smn	Wikipedia	smn	Inari Sami
Wp/sms	Wikipedia	sms	Skolt Sami
Wp/smt	Wikipedia	smt	Simte
Wp/smw	Wikipedia	smw	Sumbawa
Wt/sn	Wiktionary	sn	Shona
Wy/sn	Wikivoyage	sn	Shona
Ws/sn	Wikisource	sn	Shona
Wq/sn	Wikiquote	sn	Shona
Wp/sn	Wikipedia	sn	Shona
Wb/sn	Wikibooks	sn	Shona
Wp/sne	Wikipedia	sne	Bau Bidayuh
Wp/snk	Wikipedia	snk	Soninke
Wq/so	Wikiquote	so	Somali
Wt/so	Wiktionary	so	Somali
Wy/so	Wikivoyage	so	Somali
Wn/so	Wikinews	so	Somali
Wp/so	Wikipedia	so	Somali
Wb/so	Wikibooks	so	Somali
Wt/sq	Wiktionary	sq	Albanian
Wq/sq	Wikiquote	sq	Albanian
Ws/sq	Wikisource	sq	Albanian
Wy/sq	Wikivoyage	sq	Albanian
Wb/sq	Wikibooks	sq	Albanian
Wn/sq	Wikinews	sq	Albanian
Wp/sq	Wikipedia	sq	Albanian
Wp/sqt	Wikipedia	sqt	Soqotri
Ws/sr	Wikisource	sr	Serbian
Wq/sr	Wikiquote	sr	Serbian
Wt/sr	Wiktionary	sr	Serbian
Wy/sr	Wikivoyage	sr	Serbian
Wp/sr	Wikipedia	sr	Serbian
Wb/sr	Wikibooks	sr	Serbian
Wn/sr	Wikinews	sr	Serbian
Wp/srb	Wikipedia	srb	Sora
Wp/srh	Wikipedia	srh	Sarikoli
Wp/srn	Wikipedia	srn	Sranan Tongo
Wp/sro	Wikipedia	sro	Campidanese Sardinian
Wp/srq	Wikipedia	srq	Sirionó
Wp/srr	Wikipedia	srr	Serer
Wt/ss	Wiktionary	ss	Swati
Wp/ss	Wikipedia	ss	Swati
Wp/ssf	Wikipedia	ssf	Thao
Wt/ssf	Wiktionary	ssf	Thao
Wp/st	Wikipedia	st	Southern Sotho
Wt/st	Wiktionary	st	Southern Sotho
Wp/stl	Wikipedia	stl	Stellingwerfs
Wp/sto	Wikipedia	sto	Stoney
Wp/stq	Wikipedia	stq	Saterland Frisian
Wt/stq	Wiktionary	stq	Saterland Frisian
Wp/str	Wikipedia	str	Straits Salish
Wp/sty	Wikipedia	sty	Siberian Tatar
Wy/su	Wikivoyage	su	Sundanese
Wt/su	Wiktionary	su	Sundanese
Ws/su	Wikisource	su	Sundanese
Wb/su	Wikibooks	su	Sundanese
Wq/su	Wikiquote	su	Sundanese
Wp/su	Wikipedia	su	Sundanese
Ws/suk	Wikisource	suk	Sukuma
Wp/sus	Wikipedia	sus	Susu
Wp/suz	Wikipedia	suz	Sunwar
Ws/sv	Wikisource	sv	Swedish
Wt/sv	Wiktionary	sv	Swedish
Wv/sv	Wikiversity	sv	Swedish
Wy/sv	Wikivoyage	sv	Swedish
Wq/sv	Wikiquote	sv	Swedish
Wb/sv	Wikibooks	sv	Swedish
Wn/sv	Wikinews	sv	Swedish
Wp/sv	Wikipedia	sv	Swedish
Wt/sva	Wiktionary	sva	Svan
Wq/sva	Wikiquote	sva	Svan
Wb/sva	Wikibooks	sva	Svan
Wp/sva	Wikipedia	sva	Svan
Ws/sw	Wikisource	sw	Swahili
Wv/sw	Wikiversity	sw	Swahili
Wt/sw	Wiktionary	sw	Swahili
Wy/sw	Wikivoyage	sw	Swahili
Wb/sw	Wikibooks	sw	Swahili
Wp/sw	Wikipedia	sw	Swahili
Wq/sw	Wikiquote	sw	Swahili
Wp/swi	Wikipedia	swi	Sui
Wt/swu	Wiktionary	swu	Suwawa
Wp/swu	Wikipedia	swu	Suwawa
Wp/sxn	Wikipedia	sxn	Sangir
Wp/sxr	Wikipedia	sxr	Saaroa
Wp/sxu	Wikipedia	sxu	Upper Saxon
Wq/syc	Wikiquote	syc	Classical Syriac
Wt/syc	Wiktionary	syc	Classical Syriac
Wq/syl	Wikiquote	syl	Sylheti
Wt/syl	Wiktionary	syl	Sylheti
Wy/syl	Wikivoyage	syl	Sylheti
Wp/syl	Wikipedia	syl	Sylheti
Wb/syl	Wikibooks	syl	Sylheti
Wn/syl	Wikinews	syl	Sylheti
Wt/szl	Wiktionary	szl	Silesian
Wp/szl	Wikipedia	szl	Silesian
Wq/szl	Wikiquote	szl	Silesian
Wt/szy	Wiktionary	szy	Sakizaya
Wp/szy	Wikipedia	szy	Sakizaya
Wy/ta	Wikivoyage	ta	Tamil
Wq/ta	Wikiquote	ta	Tamil
Ws/ta	Wikisource	ta	Tamil
Wt/ta	Wiktionary	ta	Tamil
Wb/ta	Wikibooks	ta	Tamil
Wn/ta	Wikinews	ta	Tamil
Wp/ta	Wikipedia	ta	Tamil
Wp/tab	Wikipedia	tab	Tabassaran
Wp/taj	Wikipedia	taj	Eastern Tamang
Wt/tao	Wiktionary	tao	Yami
Wp/tao	Wikipedia	tao	Yami
Wp/taq	Wikipedia	taq	Tamasheq
Wp/tar	Wikipedia	tar	Central Tarahumara
Wp/tay	Wikipedia	tay	Atayal
Wt/tay	Wiktionary	tay	Atayal
Wp/tbz	Wikipedia	tbz	Ditammari
Wp/tcs	Wikipedia	tcs	Torres Strait Creole
Ws/tcy	Wikisource	tcy	Tulu
Wt/tcy	Wiktionary	tcy	Tulu
Wp/tcy	Wikipedia	tcy	Tulu
Wq/tcy	Wikiquote	tcy	Tulu
Wp/tcz	Wikipedia	tcz	Thado Chin
Wp/tdd	Wikipedia	tdd	Tai Nuea
Wp/tdg	Wikipedia	tdg	Western Tamang
Wt/tdx	Wiktionary	tdx	Tandroy-Mahafaly Malagasy
Ws/te	Wikisource	te	Telugu
Wt/te	Wiktionary	te	Telugu
Wv/te	Wikiversity	te	Telugu
Wy/te	Wikivoyage	te	Telugu
Wq/te	Wikiquote	te	Telugu
Wb/te	Wikibooks	te	Telugu
Wn/te	Wikinews	te	Telugu
Wp/te	Wikipedia	te	Telugu
Wp/tek	Wikipedia	tek	Ibali Teke
Wt/tet	Wiktionary	tet	Tetum
Ws/tet	Wikisource	tet	Tetum
Wp/tet	Wikipedia	tet	Tetum
Wp/tft	Wikipedia	tft	Ternate
Ws/tg	Wikisource	tg	Tajik
Wy/tg	Wikivoyage	tg	Tajik
Wt/tg	Wiktionary	tg	Tajik
Wq/tg	Wikiquote	tg	Tajik
Wp/tg	Wikipedia	tg	Tajik
Wn/tg	Wikinews	tg	Tajik
Wb/tg	Wikibooks	tg	Tajik
Wt/th	Wiktionary	th	Thai
Ws/th	Wikisource	th	Thai
Wy/th	Wikivoyage	th	Thai
Wv/th	Wikiversity	th	Thai
Wn/th	Wikinews	th	Thai
Wq/th	Wikiquote	th	Thai
Wb/th	Wikibooks	th	Thai
Wp/th	Wikipedia	th	Thai
Wp/thl	Wikipedia	thl	Dangaura Tharu
Wp/thr	Wikipedia	thr	Rana Tharu
Wt/ti	Wiktionary	ti	Tigrinya
Wp/ti	Wikipedia	ti	Tigrinya
Wt/tig	Wiktionary	tig	Tigre
Wp/tig	Wikipedia	tig	Tigre
Wp/tin	Wikipedia	tin	Tindi
Wp/tiv	Wikipedia	tiv	Tiv
Wp/tiw	Wikipedia	tiw	Tiwi
Wt/tiw	Wiktionary	tiw	Tiwi
Wp/tji	Wikipedia	tji	Northern Tujia
Wt/tk	Wiktionary	tk	Turkmen
Wq/tk	Wikiquote	tk	Turkmen
Wy/tk	Wikivoyage	tk	Turkmen
Wp/tk	Wikipedia	tk	Turkmen
Wb/tk	Wikibooks	tk	Turkmen
Wp/tkl	Wikipedia	tkl	Tokelau
Wp/tkn	Wikipedia	tkn	Toku-No-Shima
Wp/tkr	Wikipedia	tkr	Tsakhur
Ws/tl	Wikisource	tl	Tagalog
Wt/tl	Wiktionary	tl	Tagalog
Wy/tl	Wikivoyage	tl	Tagalog
Wq/tl	Wikiquote	tl	Tagalog
Wb/tl	Wikibooks	tl	Tagalog
Wn/tl	Wikinews	tl	Tagalog
Wp/tl	Wikipedia	tl	Tagalog
Wt/tlh	Wiktionary	tlh	Klingon
Wp/tli	Wikipedia	tli	Tlingit
Wq/tly	Wikiquote	tly	Talysh
Wt/tly	Wiktionary	tly	Talysh
Wp/tly	Wikipedia	tly	Talysh
Wb/tly	Wikibooks	tly	Talysh
Wn/tly	Wikinews	tly	Talysh
Wp/tmr	Wikipedia	tmr	Jewish Babylonian Aramaic (ca. 200-1200 CE)
Wy/tmr	Wikivoyage	tmr	Jewish Babylonian Aramaic (ca. 200-1200 CE)
Wq/tn	Wikiquote	tn	Tswana
Wt/tn	Wiktionary	tn	Tswana
Wn/tn	Wikinews	tn	Tswana
Wp/tn	Wikipedia	tn	Tswana
Wp/tnt	Wikipedia	tnt	Tontemboan
Wt/to	Wiktionary	to	Tongan
Wp/to	Wikipedia	to	Tongan
Wp/tog	Wikipedia	tog	Tonga (Nyasa)
Ws/tok	Wikisource	tok	Toki Pona
Wp/top	Wikipedia	top	Papantla Totonac
Wp/tox	Wikipedia	tox	Tobian
Wt/tpi	Wiktionary	tpi	Tok Pisin
Wp/tpi	Wikipedia	tpi	Tok Pisin
Ws/tpn	Wikisource	tpn	Tupinambá
Wt/tr	Wiktionary	tr	Turkish
Ws/tr	Wikisource	tr	Turkish
Wv/tr	Wikiversity	tr	Turkish
Wy/tr	Wikivoyage	tr	Turkish
Wq/tr	Wikiquote	tr	Turkish
Wb/tr	Wikibooks	tr	Turkish
Wn/tr	Wikinews	tr	Turkish
Wp/tr	Wikipedia	tr	Turkish
Wp/trp	Wikipedia	trp	Kok Borok
Wp/trs	Wikipedia	trs	Chicahuaxtla Triqui
Wp/tru	Wikipedia	tru	Turoyo
Wp/trv	Wikipedia	trv	Taroko
Wt/trv	Wiktionary	trv	Taroko
Wp/trw	Wikipedia	trw	Torwali
Wt/ts	Wiktionary	ts	Tsonga
Wp/ts	Wikipedia	ts	Tsonga
Wp/tsd	Wikipedia	tsd	Tsakonian
Wp/tse	Wikipedia	tse	Tunisian Sign Language
Wp/tsg	Wikipedia	tsg	Tausug
Wp/tsu	Wikipedia	tsu	Tsou
Wt/tsu	Wiktionary	tsu	Tsou
Wq/tt	Wikiquote	tt	Tatar
Ws/tt	Wikisource	tt	Tatar
Wt/tt	Wiktionary	tt	Tatar
Wy/tt	Wikivoyage	tt	Tatar
Wb/tt	Wikibooks	tt	Tatar
Wn/tt	Wikinews	tt	Tatar
Wp/tt	Wikipedia	tt	Tatar
Wt/tts	Wiktionary	tts	Northeastern Thai
Wp/tts	Wikipedia	tts	Northeastern Thai
Wp/ttt	Wikipedia	ttt	Muslim Tat
Wq/tum	Wikiquote	tum	Tumbuka
Wy/tum	Wikivoyage	tum	Tumbuka
Wt/tum	Wiktionary	tum	Tumbuka
Wp/tum	Wikipedia	tum	Tumbuka
Wb/tum	Wikibooks	tum	Tumbuka
Wn/tum	Wikinews	tum	Tumbuka
Wp/tun	Wikipedia	tun	Tunica
Wp/tuo	Wikipedia	tuo	Tucano
Wp/tuq	Wikipedia	tuq	Tedaga
Wp/tvl	Wikipedia	tvl	Tuvalu
Wp/tvx	Wikipedia	tvx	Taivoan
Wb/tw	Wikibooks	tw	Twi
Wp/tw	Wikipedia	tw	Twi
Wt/tw	Wiktionary	tw	Twi
Wp/twm	Wikipedia	twm	Tawang Monpa
Ws/txg	Wikisource	txg	Tangut
Wp/txn	Wikipedia	txn	West Tarangan
Wt/ty	Wiktionary	ty	Tahitian
Wp/ty	Wikipedia	ty	Tahitian
Wn/tyv	Wikinews	tyv	Tuvinian
Wp/tyv	Wikipedia	tyv	Tuvinian
Ws/tyv	Wikisource	tyv	Tuvinian
Wt/tyv	Wiktionary	tyv	Tuvinian
Wp/tyz	Wikipedia	tyz	Tày
Wt/tyz	Wiktionary	tyz	Tày
Wp/tzh	Wikipedia	tzh	Tzeltal
Wp/tzl	Wikipedia	tzl	Talossan
Wp/tzm	Wikipedia	tzm	Central Atlas Tamazight
Wt/tzm	Wiktionary	tzm	Central Atlas Tamazight
Wy/tzm	Wikivoyage	tzm	Central Atlas Tamazight
Wp/tzo	Wikipedia	tzo	Tzotzil
Wp/ubl	Wikipedia	ubl	Buhi'non Bikol
Wt/ude	Wiktionary	ude	Udihe
Wp/ude	Wikipedia	ude	Udihe
Wp/udi	Wikipedia	udi	Udi
Wp/udm	Wikipedia	udm	Udmurt
Ws/udm	Wikisource	udm	Udmurt
Wt/udm	Wiktionary	udm	Udmurt
Wy/udm	Wikivoyage	udm	Udmurt
Wq/ug	Wikiquote	ug	Uyghur
Wy/ug	Wikivoyage	ug	Uyghur
Wt/ug	Wiktionary	ug	Uyghur
Wp/ug	Wikipedia	ug	Uyghur
Wb/ug	Wikibooks	ug	Uyghur
Wt/uk	Wiktionary	uk	Ukrainian
Ws/uk	Wikisource	uk	Ukrainian
Wv/uk	Wikiversity	uk	Ukrainian
Wy/uk	Wikivoyage	uk	Ukrainian
Wq/uk	Wikiquote	uk	Ukrainian
Wb/uk	Wikibooks	uk	Ukrainian
Wn/uk	Wikinews	uk	Ukrainian
Wp/uk	Wikipedia	uk	Ukrainian
Wp/ulc	Wikipedia	ulc	Ulch
Wt/ulc	Wiktionary	ulc	Ulch
Wp/ulk	Wikipedia	ulk	Meriam Mir
Wp/uln	Wikipedia	uln	Unserdeutsch
Wp/umb	Wikipedia	umb	Umbundu
Wp/unm	Wikipedia	unm	Unami
Wq/ur	Wikiquote	ur	Urdu
Ws/ur	Wikisource	ur	Urdu
Wy/ur	Wikivoyage	ur	Urdu
Wt/ur	Wiktionary	ur	Urdu
Wb/ur	Wikibooks	ur	Urdu
Wn/ur	Wikinews	ur	Urdu
Wp/ur	Wikipedia	ur	Urdu
Wp/urh	Wikipedia	urh	Urhobo
Wp/uum	Wikipedia	uum	Urum
Wy/uz	Wikivoyage	uz	Uzbek
Wt/uz	Wiktionary	uz	Uzbek
Ws/uz	Wikisource	uz	Uzbek
Wq/uz	Wikiquote	uz	Uzbek
Wb/uz	Wikibooks	uz	Uzbek
Wn/uz	Wikinews	uz	Uzbek
Wp/uz	Wikipedia	uz	Uzbek
Wp/uzs	Wikipedia	uzs	Southern Uzbek
Wp/vai	Wikipedia	vai	Vai
Wp/vap	Wikipedia	vap	Vaiphei
Wp/var	Wikipedia	var	Huarijio
Wp/vay	Wikipedia	vay	Wayu
Wp/ve	Wikipedia	ve	Venda
Wt/ve	Wiktionary	ve	Venda
Wy/vec	Wikivoyage	vec	Venetian
Wt/vec	Wiktionary	vec	Venetian
Ws/vec	Wikisource	vec	Venetian
Wp/vec	Wikipedia	vec	Venetian
Wn/vec	Wikinews	vec	Venetian
Wy/vep	Wikivoyage	vep	Veps
Ws/vep	Wikisource	vep	Veps
Wt/vep	Wiktionary	vep	Veps
Wp/vep	Wikipedia	vep	Veps
Wq/vep	Wikiquote	vep	Veps
Wt/vi	Wiktionary	vi	Vietnamese
Ws/vi	Wikisource	vi	Vietnamese
Wv/vi	Wikiversity	vi	Vietnamese
Wy/vi	Wikivoyage	vi	Vietnamese
Wq/vi	Wikiquote	vi	Vietnamese
Wb/vi	Wikibooks	vi	Vietnamese
Wn/vi	Wikinews	vi	Vietnamese
Wp/vi	Wikipedia	vi	Vietnamese
Wp/vkt	Wikipedia	vkt	Tenggarong Kutai Malay
Wt/vls	Wiktionary	vls	West Flemish
Wp/vls	Wikipedia	vls	West Flemish
Wp/vmf	Wikipedia	vmf	Mainfränkisch
Wp/vmw	Wikipedia	vmw	Makhuwa
Wt/vo	Wiktionary	vo	Volapük
Ws/vo	Wikisource	vo	Volapük
Wq/vo	Wikiquote	vo	Volapük
Wb/vo	Wikibooks	vo	Volapük
Wp/vo	Wikipedia	vo	Volapük
Wp/vro	Wikipedia	vro	Võro
Ws/wa	Wikisource	wa	Walloon
Wt/wa	Wiktionary	wa	Walloon
Wp/wa	Wikipedia	wa	Walloon
Wb/wa	Wikibooks	wa	Walloon
Wb/wal	Wikibooks	wal	Wolaytta
Wn/wal	Wikinews	wal	Wolaytta
Wp/wal	Wikipedia	wal	Wolaytta
Wq/wal	Wikiquote	wal	Wolaytta
Wt/wal	Wiktionary	wal	Wolaytta
Wy/wal	Wikivoyage	wal	Wolaytta
Wt/war	Wiktionary	war	Waray
Wb/war	Wikibooks	war	Waray
Wp/war	Wikipedia	war	Waray
Wp/was	Wikipedia	was	Washo
Wp/wba	Wikipedia	wba	Warao
Wp/wbl	Wikipedia	wbl	Wakhi
Wp/wbp	Wikipedia	wbp	Warlpiri
Wp/wep	Wikipedia	wep	Westphalien
Wp/wja	Wikipedia	wja	Waja
Wp/wls	Wikipedia	wls	Wallisian
Wp/wlx	Wikipedia	wlx	Wali (Ghana)
Wq/wo	Wikiquote	wo	Wolof
Wt/wo	Wiktionary	wo	Wolof
Wp/wo	Wikipedia	wo	Wolof
Wp/wsg	Wikipedia	wsg	Adilabad Gondi
Wt/wsg	Wiktionary	wsg	Adilabad Gondi
Wy/wuu	Wikivoyage	wuu	Wu
Wt/wuu	Wiktionary	wuu	Wu
Wq/wuu	Wikiquote	wuu	Wu
Wp/wuu	Wikipedia	wuu	Wu
Wn/wuu	Wikinews	wuu	Wu
Wb/wuu	Wikibooks	wuu	Wu
Wp/wxa	Wikipedia	wxa	Waxianghua
Wp/wym	Wikipedia	wym	Wymysorys
Ws/wym	Wikisource	wym	Wymysorys
Wt/wym	Wiktionary	wym	Wymysorys
Wy/wym	Wikivoyage	wym	Wymysorys
Wt/xal	Wiktionary	xal	Kalmyk
Wp/xal	Wikipedia	xal	Kalmyk
Wp/xav	Wikipedia	xav	Xavánte
Wp/xdy	Wikipedia	xdy	Malayic Dayak
Wp/xer	Wikipedia	xer	Xerénte
Wt/xh	Wiktionary	xh	Xhosa
Ws/xh	Wikisource	xh	Xhosa
Wp/xh	Wikipedia	xh	Xhosa
Wn/xh	Wikinews	xh	Xhosa
Wb/xh	Wikibooks	xh	Xhosa
Wp/xhe	Wikipedia	xhe	Khetrani
Wp/xkv	Wikipedia	xkv	Kgalagadi
Wt/xmf	Wiktionary	xmf	Mingrelian
Ws/xmf	Wikisource	xmf	Mingrelian
Wp/xmf	Wikipedia	xmf	Mingrelian
Wq/xmf	Wikiquote	xmf	Mingrelian
Wp/xmm	Wikipedia	xmm	Manado Malay
Wp/xnb	Wikipedia	xnb	Kanakanabu
Wp/xon	Wikipedia	xon	Konkomba
Wp/xpq	Wikipedia	xpq	Mohegan-Pequot
Wp/xsb	Wikipedia	xsb	Sambal
Wp/xsr	Wikipedia	xsr	Sherpa
Wp/xsy	Wikipedia	xsy	Saisiyat
Wp/xug	Wikipedia	xug	Kunigami
Wp/xvi	Wikipedia	xvi	Kamviri
Wp/xzh	Wikipedia	xzh	Zhang-Zhung
Wp/yah	Wikipedia	yah	Yazgulyam
Wp/yai	Wikipedia	yai	Yagnobi
Wp/yap	Wikipedia	yap	Yapese
Wp/yaq	Wikipedia	yaq	Yaqui
Wp/yav	Wikipedia	yav	Yangben
Wp/ybe	Wikipedia	ybe	West Yugur
Wp/ycr	Wikipedia	ycr	Yilan Creole
Wp/ydg	Wikipedia	ydg	Yidgha
Wp/yer	Wikipedia	yer	Tarok
Wp/ygp	Wikipedia	ygp	Gepo
Wy/yi	Wikivoyage	yi	Yiddish
Wt/yi	Wiktionary	yi	Yiddish
Ws/yi	Wikisource	yi	Yiddish
Wp/yi	Wikipedia	yi	Yiddish
Wn/yi	Wikinews	yi	Yiddish
Wb/yi	Wikibooks	yi	Yiddish
Wp/yka	Wikipedia	yka	Yakan
Wt/yo	Wiktionary	yo	Yoruba
Wp/yo	Wikipedia	yo	Yoruba
Wb/yo	Wikibooks	yo	Yoruba
Wp/yoi	Wikipedia	yoi	Yonaguni
Ws/yol	Wikisource	yol	Yola
Wp/yox	Wikipedia	yox	Yoron
Wp/yrk	Wikipedia	yrk	Nenets
Ws/yrk	Wikisource	yrk	Nenets
Wt/yrl	Wiktionary	yrl	Nhengatu
Ws/yrl	Wikisource	yrl	Nhengatu
Wp/yrl	Wikipedia	yrl	Nhengatu
Wp/yua	Wikipedia	yua	Yucateco
Wt/yua	Wiktionary	yua	Yucateco
Wp/yuc	Wikipedia	yuc	Yuchi
Wt/yue	Wiktionary	yue	Cantonese
Ws/yue	Wikisource	yue	Cantonese
Wq/yue	Wikiquote	yue	Cantonese
Wy/yue	Wikivoyage	yue	Cantonese
Wb/yue	Wikibooks	yue	Cantonese
Wn/yue	Wikinews	yue	Cantonese
Wp/yue	Wikipedia	yue	Cantonese
Wq/za	Wikiquote	za	Zhuang
Wt/za	Wiktionary	za	Zhuang
Wp/za	Wikipedia	za	Zhuang
Wb/za	Wikibooks	za	Zhuang
Wp/zai	Wikipedia	zai	Isthmus Zapotec
Wp/zap	Wikipedia	zap	Zapotec
Wp/zea	Wikipedia	zea	Zeelandic
Wt/zea	Wiktionary	zea	Zeelandic
Wy/zea	Wikivoyage	zea	Zeelandic
Wp/zeh	Wikipedia	zeh	Eastern Hongshuihe Zhuang
Wp/zen	Wikipedia	zen	Zenaga
Wt/zgh	Wiktionary	zgh	Standard Moroccan Tamazight
Wp/zgh	Wikipedia	zgh	Standard Moroccan Tamazight
Ws/zh	Wikisource	zh	Chinese
Wt/zh	Wiktionary	zh	Chinese
Wy/zh	Wikivoyage	zh	Chinese
Wv/zh	Wikiversity	zh	Chinese
Wn/zh	Wikinews	zh	Chinese
Wq/zh	Wikiquote	zh	Chinese
Wb/zh	Wikibooks	zh	Chinese
Wp/zh	Wikipedia	zh	Chinese
Wp/zh-classical	Wikipedia	zh-classical	Literary Chinese
Ws/zkt	Wikisource	zkt	Kitan
Wp/zmi	Wikipedia	zmi	Negeri Sembilan Malay
Wp/zom	Wikipedia	zom	Zou
Wb/zu	Wikibooks	zu	Zulu
Wy/zu	Wikivoyage	zu	Zulu
Wt/zu	Wiktionary	zu	Zulu
Ws/zu	Wikisource	zu	Zulu
Wp/zu	Wikipedia	zu	Zulu
Wp/zun	Wikipedia	zun	Zuni
Wp/zyj	Wikipedia	zyj	Youjiang Zhuang
Wy/zyj	Wikivoyage	zyj	Youjiang Zhuang
