Full_name	prefix	project_name
Wikibooks Ainu (wb/ain)	wb/ain	Wikibooks Ainu
Wikibooks Egyptian Arabic (wb/arz)	wb/arz	Wikibooks Egyptian Arabic
Wikibooks Assamese (wb/as)	wb/as	Wikibooks Assamese
Wikibooks Chittagonian (wb/ctg)	wb/ctg	Wikibooks Chittagonian
Wikibooks Zazaki (wb/diq)	wb/diq	Wikibooks Zazaki
Wikibooks Dhivehi (wb/dv)	wb/dv	Wikibooks Dhivehi
Wikibooks Fijian (wb/fj)	wb/fj	Wikibooks Fijian
Wikibooks Hausa (wb/ha)	wb/ha	Wikibooks Hausa
Wikibooks Fiji Hindi (wb/hif)	wb/hif	Wikibooks Fiji Hindi
Wikibooks Haitian Creole (wb/ht)	wb/ht	Wikibooks Haitian Creole
Wikibooks Jamaican Creole (wb/jam)	wb/jam	Wikibooks Jamaican Creole
Wikibooks Jatki (wb/jat)	wb/jat	Wikibooks Jatki
Wikibooks Javanese (wb/jv)	wb/jv	Wikibooks Javanese
Wikibooks Latvian (wb/lv)	wb/lv	Wikibooks Latvian
Wikibooks Minangkabau (wb/min)	wb/min	Wikibooks Minangkabau
Wikibooks Manchu (wb/mnc)	wb/mnc	Wikibooks Manchu
Wikibooks Mon (wb/mnw)	wb/mnw	Wikibooks Mon
Wikibooks Min Nan Chinese (wb/nan)	wb/nan	Wikibooks Min Nan Chinese
Wikibooks Nias (wb/nia)	wb/nia	Wikibooks Nias
Wikibooks Ossetic (wb/os)	wb/os	Wikibooks Ossetic
Wikibooks Pashto (wb/ps)	wb/ps	Wikibooks Pashto
Wikibooks Ancash Quechua (wb/qwh)	wb/qwh	Wikibooks Ancash Quechua
Wikibooks Santali (wb/sat)	wb/sat	Wikibooks Santali
Wikibooks Shan (wb/shn)	wb/shn	Wikibooks Shan
Wikibooks Saraiki (wb/skr)	wb/skr	Wikibooks Saraiki
Wikibooks Somali (wb/so)	wb/so	Wikibooks Somali
Wikibooks Sundanese (wb/su)	wb/su	Wikibooks Sundanese
Wikibooks Sylheti (wb/syl)	wb/syl	Wikibooks Sylheti
Wikibooks Tumbuka (wb/tum)	wb/tum	Wikibooks Tumbuka
Wikibooks Cantonese (wb/yue)	wb/yue	Wikibooks Cantonese
Wikinews Angika (wn/anp)	wn/anp	Wikinews Angika
Wikinews Azerbaijani (wn/az)	wn/az	Wikinews Azerbaijani
Wikinews South Azerbaijani (wn/azb)	wn/azb	Wikinews South Azerbaijani
Wikinews Belarusian (wn/be)	wn/be	Wikinews Belarusian
Wikinews Bhojpuri (wn/bho)	wn/bho	Wikinews Bhojpuri
Wikinews Bengali (wn/bn)	wn/bn	Wikinews Bengali
Wikinews Min Dong (wn/cdo)	wn/cdo	Wikinews Min Dong
Wikinews Kurdish (Sorani) (wn/ckb)	wn/ckb	Wikinews Kurdish
Wikinews Pu-Xian Min (wn/cpx)	wn/cpx	Wikinews Pu-Xian Min
Wikinews Chittagonian (wn/ctg)	wn/ctg	Wikinews Chittagonian
Wikinews Zazaki (wn/diq)	wn/diq	Wikinews Zazaki
Wikinews Estonian (wn/et)	wn/et	Wikinews Estonian
Wikinews Gungbe (wn/guw)	wn/guw	Wikinews Gungbe
Wikinews Hindi (wn/hi)	wn/hi	Wikinews Hindi
Wikinews Croatian (wn/hr)	wn/hr	Wikinews Croatian
Wikinews Hungarian (wn/hu)	wn/hu	Wikinews Hungarian
Wikinews Indonesian (wn/id)	wn/id	Wikinews Indonesian
Wikinews Jatki (wn/jat)	wn/jat	Wikinews Jatki
Wikinews Javanese (wn/jv)	wn/jv	Wikinews Javanese
Wikinews Georgian (wn/ka)	wn/ka	Wikinews Georgian
Wikinews Karakalpak (wn/kaa)	wn/kaa	Wikinews Karakalpak
Wikinews Khowar (wn/khw)	wn/khw	Wikinews Khowar
Wikinews Ladino (wn/lad)	wn/lad	Wikinews Ladino
Wikinews Lao (wn/lo)	wn/lo	Wikinews Lao
Wikinews Lithuanian (wn/lt)	wn/lt	Wikinews Lithuanian
Wikinews Minangkabau (wn/min)	wn/min	Wikinews Minangkabau
Wikinews Kupang Malay (wn/mkn)	wn/mkn	Wikinews Kupang Malay
Wikinews Malay (wn/ms)	wn/ms	Wikinews Malay
Wikinews Mazandarani (wn/mzn)	wn/mzn	Wikinews Mazandarani
Wikinews Min Nan (wn/nan)	wn/nan	Wikinews Min Nan
Wikinews Nepali (wn/ne)	wn/ne	Wikinews Nepali
Wikinews Nias (wn/nia)	wn/nia	Wikinews Nias
Wikinews Oromo (wn/om)	wn/om	Wikinews Oromo
Wikinews Western Punjabi (wn/pnb)	wn/pnb	Wikinews Western Punjabi
Wikinews Pipil (wn/ppl)	wn/ppl	Wikinews Pipil
Wikinews Kinyarwanda (wn/rw)	wn/rw	Wikinews Kinyarwanda
Wikinews Santali (wn/sat)	wn/sat	Wikinews Santali
Wikinews Sicilian (wn/scn)	wn/scn	Wikinews Sicilian
Wikinews Shan (wn/shn)	wn/shn	Wikinews Shan
Wikinews Sinhalese (wn/si)	wn/si	Wikinews Sinhalese
Wikinews Saraiki (wn/skr)	wn/skr	Wikinews Saraiki
Wikinews Sylheti (wn/syl)	wn/syl	Wikinews Sylheti
Wikinews Tajik (wn/tg)	wn/tg	Wikinews Tajik
Wikinews Thai (wn/th)	wn/th	Wikinews Thai
Wikinews Tagalog (wn/tl)	wn/tl	Wikinews Tagalog
Wikinews Tswana (wn/tn)	wn/tn	Wikinews Tswana
Wikinews Turkish (wn/tr)	wn/tr	Wikinews Turkish
Wikinews Tumbuka (wn/tum)	wn/tum	Wikinews Tumbuka
Wikinews Urdu (wn/ur)	wn/ur	Wikinews Urdu
Wikinews Vietnamese (wn/vi)	wn/vi	Wikinews Vietnamese
Wikinews Cantonese (wn/yue)	wn/yue	Wikinews Cantonese
Wikipedia Arbëresh (wp/aae)	wp/aae	Wikipedia Arbëresh
Wikipedia Saint Lucian Creole (wp/acf)	wp/acf	Wikipedia Saint Lucian Creole
Wikipedia Mesopotamian Arabic (wp/acm)	wp/acm	Wikipedia Mesopotamian Arabic
Wikipedia Tunisian Arabic (wp/aeb)	wp/aeb	Wikipedia Tunisian Arabic
Wikipedia Ainu (wp/ain)	wp/ain	Wikipedia Ainu
Wikipedia Judeo-Moroccan Arabic (wp/aju)	wp/aju	Wikipedia Judeo-Moroccan Arabic
Wikipedia Alabama (wp/akz)	wp/akz	Wikipedia Alabama
Wikipedia Aleut (wp/ale)	wp/ale	Wikipedia Aleut
Wikipedia Gheg Albanian (wp/aln)	wp/aln	Wikipedia Gheg Albanian
Wikipedia Obolo (wp/ann)	wp/ann	Wikipedia Obolo
Wikipedia Angika (wp/anp)	wp/anp	Wikipedia Angika
Wikipedia Pemon (wp/aoc)	wp/aoc	Wikipedia Pemon
Wikipedia Levantine Arabic (wp/apc)	wp/apc	Wikipedia Levantine Arabic
Wikipedia Western Apache (wp/apw)	wp/apw	Wikipedia Western Apache
Wikipedia Mapudungun (wp/arn)	wp/arn	Wikipedia Mapudungun
Wikipedia Araona (wp/aro)	wp/aro	Wikipedia Araona
Wikipedia Algerian Arabic (wp/arq)	wp/arq	Wikipedia Algerian Arabic
Wikipedia American Sign (wp/ase)	wp/ase	Wikipedia American Sign
Wikipedia Askunu (wp/ask)	wp/ask	Wikipedia Askunu
Wikipedia Northern Altai (wp/atv)	wp/atv	Wikipedia Northern Altai
Wikipedia Badui (wp/bac)	wp/bac	Wikipedia Badui
Wikipedia Balochi (wp/bal)	wp/bal	Wikipedia Balochi
Wikipedia Toba Batak (wp/bbc)	wp/bbc	Wikipedia Toba Batak
Wikipedia Ghomala' (wp/bbj)	wp/bbj	Wikipedia Ghomala'
Wikipedia Bats (wp/bbl)	wp/bbl	Wikipedia Bats
Wikipedia Central Bai (wp/bca)	wp/bca	Wikipedia Central Bai
Wikipedia Southern Baluchi (wp/bcc)	wp/bcc	Wikipedia Southern Baluchi
Wikipedia Baoulé (wp/bci)	wp/bci	Wikipedia Baoulé
Wikipedia West Coast Bajau (wp/bdr)	wp/bdr	Wikipedia West Coast Bajau
Wikipedia Bemba (wp/bem)	wp/bem	Wikipedia Bemba
Wikipedia Betawi (wp/bew)	wp/bew	Wikipedia Betawi
Wikipedia Badaga (wp/bfq)	wp/bfq	Wikipedia Badaga
Wikipedia Western Baluchi (wp/bgn)	wp/bgn	Wikipedia Western Baluchi
Wikipedia Balkan Gagauz Turkish (wp/bgx)	wp/bgx	Wikipedia Balkan Gagauz Turkish
Wikipedia Banggai (wp/bgz)	wp/bgz	Wikipedia Banggai
Wikipedia Bunun (wp/bnn)	wp/bnn	Wikipedia Bunun
Wikipedia Asi (wp/bno)	wp/bno	Wikipedia Asi
Wikipedia Brahui (wp/brh)	wp/brh	Wikipedia Brahui
Wikipedia Bodo (wp/brx)	wp/brx	Wikipedia Bodo
Wikipedia Batak Dairi (wp/btd)	wp/btd	Wikipedia Batak Dairi
Wikipedia Mandailing (wp/btm)	wp/btm	Wikipedia Mandailing
Wikipedia Rinconada (wp/bto)	wp/bto	Wikipedia Rinconada
Wikipedia Karo (wp/btx)	wp/btx	Wikipedia Karo
Wikipedia Bura (wp/bwr)	wp/bwr	Wikipedia Bura
Wikipedia Medumba (wp/byv)	wp/byv	Wikipedia Medumba
Wikipedia Bribri (wp/bzd)	wp/bzd	Wikipedia Bribri
Wikipedia Belizean Creole (wp/bzj)	wp/bzj	Wikipedia Belizean Creole
Wikipedia Brazilian Sign (wp/bzs)	wp/bzs	Wikipedia Brazilian Sign
Wikipedia Kaqchikel (wp/cak)	wp/cak	Wikipedia Kaqchikel
Wikipedia Chibcha (wp/chb)	wp/chb	Wikipedia Chibcha
Wikipedia Chagatai (wp/chg)	wp/chg	Wikipedia Chagatai
Wikipedia Chinook Jargon (wp/chn)	wp/chn	Wikipedia Chinook Jargon
Wikipedia Choctaw (wp/cho)	wp/cho	Wikipedia Choctaw
Wikipedia Shor (wp/cjs)	wp/cjs	Wikipedia Shor
Wikipedia Jin Chinese (wp/cjy)	wp/cjy	Wikipedia Jin Chinese
Wikipedia Chukchi (wp/ckt)	wp/ckt	Wikipedia Chukchi
Wikipedia Kavalan (wp/ckv)	wp/ckv	Wikipedia Kavalan
Wikipedia Chulym (wp/clw)	wp/clw	Wikipedia Chulym
Wikipedia Asháninka (wp/cni)	wp/cni	Wikipedia Asháninka
Wikipedia Montenegrin (wp/cnr)	wp/cnr	Wikipedia Montenegrin
Wikipedia Coptic (wp/cop)	wp/cop	Wikipedia Coptic
Wikipedia Capiznon (wp/cps)	wp/cps	Wikipedia Capiznon
Wikipedia Pu-Xian Min (wp/cpx)	wp/cpx	Wikipedia Pu-Xian Min
Wikipedia Central Sierra Miwok (wp/csm)	wp/csm	Wikipedia Central Sierra Miwok
Wikipedia Chittagonian (wp/ctg)	wp/ctg	Wikipedia Chittagonian
Wikipedia Pandan Bikol (wp/cts)	wp/cts	Wikipedia Pandan Bikol
Wikipedia Huizhou Chinese (wp/czh)	wp/czh	Wikipedia Huizhou Chinese
Wikipedia Min Zhong (wp/czo)	wp/czo	Wikipedia Min Zhong
Wikipedia Dargwa (wp/dar)	wp/dar	Wikipedia Dargwa
Wikipedia Negerhollands (wp/dcr)	wp/dcr	Wikipedia Negerhollands
Wikipedia Southern Dagaare (wp/dga)	wp/dga	Wikipedia Southern Dagaare
Wikipedia Dogri (wp/dgo)	wp/dgo	Wikipedia Dogri
Wikipedia Drehu (wp/dhv)	wp/dhv	Wikipedia Drehu
Wikipedia Dimasa (wp/dis)	wp/dis	Wikipedia Dimasa
Wikipedia Dungan (wp/dng)	wp/dng	Wikipedia Dungan
Wikipedia Rukai (wp/dru)	wp/dru	Wikipedia Rukai
Wikipedia Dusun (wp/dtp)	wp/dtp	Wikipedia Dusun
Wikipedia Efik (wp/efi)	wp/efi	Wikipedia Efik
Wikipedia Enets (wp/enf)	wp/enf	Wikipedia Enets
Wikipedia Siberian Yupik (wp/ess)	wp/ess	Wikipedia Siberian Yupik
Wikipedia Central Alaskan Yup'ik (wp/esu)	wp/esu	Wikipedia Central Alaskan Yup'ik
Wikipedia Evenki (wp/evn)	wp/evn	Wikipedia Evenki
Wikipedia Fante (wp/fat)	wp/fat	Wikipedia Fante
Wikipedia Meänkieli (wp/fit)	wp/fit	Wikipedia Meänkieli
Wikipedia Kven (wp/fkv)	wp/fkv	Wikipedia Kven
Wikipedia Salish-Spokane-Kalispel (wp/fla)	wp/fla	Wikipedia Salish-Spokane-Kalispel
Wikipedia Fon (wp/fon)	wp/fon	Wikipedia Fon
Wikipedia Cajun French (wp/frc)	wp/frc	Wikipedia Cajun French
Wikipedia East Frisian (wp/frs)	wp/frs	Wikipedia East Frisian
Wikipedia Pulaar (wp/fuc)	wp/fuc	Wikipedia Pulaar
Wikipedia Fur (wp/fvr)	wp/fvr	Wikipedia Fur
Wikipedia Ga (wp/gaa)	wp/gaa	Wikipedia Ga
Wikipedia Garhwali (wp/gbm)	wp/gbm	Wikipedia Garhwali
Wikipedia Gilbertese (wp/gil)	wp/gil	Wikipedia Gilbertese
Wikipedia Gujari (wp/gju)	wp/gju	Wikipedia Gujari
Wikipedia Nanai (wp/gld)	wp/gld	Wikipedia Nanai
Wikipedia Ghanaian Pidgin English (wp/gpe)	wp/gpe	Wikipedia Ghanaian Pidgin English
Wikipedia Ancient Greek (wp/grc)	wp/grc	Wikipedia Ancient Greek
Wikipedia Wayuu (wp/guc)	wp/guc	Wikipedia Wayuu
Wikipedia Frafra (wp/gur)	wp/gur	Wikipedia Frafra
Wikipedia Guaymí (wp/gym)	wp/gym	Wikipedia Guaymí
Wikipedia Gorani (wp/hac)	wp/hac	Wikipedia Gorani
Wikipedia Hiligaynon (wp/hil)	wp/hil	Wikipedia Hiligaynon
Wikipedia Chhattisgarhi (wp/hne)	wp/hne	Wikipedia Chhattisgarhi
Wikipedia Hiri Motu (wp/ho)	wp/ho	Wikipedia Hiri Motu
Wikipedia Hunsrik (wp/hrx)	wp/hrx	Wikipedia Hunsrik
Wikipedia Xiang (wp/hsn)	wp/hsn	Wikipedia Xiang
Wikipedia Herero (wp/hz)	wp/hz	Wikipedia Herero
Wikipedia Iban (wp/iba)	wp/iba	Wikipedia Iban
Wikipedia Ibibio (wp/ibb)	wp/ibb	Wikipedia Ibibio
Wikipedia Igala (wp/igl)	wp/igl	Wikipedia Igala
Wikipedia Sichuan Yi (wp/ii)	wp/ii	Wikipedia Sichuan Yi
Wikipedia Esan (wp/ish)	wp/ish	Wikipedia Esan
Wikipedia Nunukan Tidung (wp/itd)	wp/itd	Wikipedia Nunukan Tidung
Wikipedia Judeo-Italian (wp/itk)	wp/itk	Wikipedia Judeo-Italian
Wikipedia Itelmen (wp/itl)	wp/itl	Wikipedia Itelmen
Wikipedia Ingrian (wp/izh)	wp/izh	Wikipedia Ingrian
Wikipedia Jatki (wp/jat)	wp/jat	Wikipedia Jatki
Wikipedia Jambi Malay (wp/jax)	wp/jax	Wikipedia Jambi Malay
Wikipedia Krymchak (wp/jct)	wp/jct	Wikipedia Krymchak
Wikipedia Judeo-Tat (wp/jdt)	wp/jdt	Wikipedia Judeo-Tat
Wikipedia Judaeo-Georgian (wp/jge)	wp/jge	Wikipedia Judaeo-Georgian
Wikipedia Jeju (wp/jje)	wp/jje	Wikipedia Jeju
Wikipedia Jaqaru (wp/jqr)	wp/jqr	Wikipedia Jaqaru
Wikipedia Jurchen (wp/juc)	wp/juc	Wikipedia Jurchen
Wikipedia Jutish (wp/jut)	wp/jut	Wikipedia Jutish
Wikipedia Karai-Karai (wp/kai)	wp/kai	Wikipedia Karai-Karai
Wikipedia Khanty (wp/kca)	wp/kca	Wikipedia Khanty
Wikipedia Karaim (wp/kdr)	wp/kdr	Wikipedia Karaim
Wikipedia Cape Verdean Creole (wp/kea)	wp/kea	Wikipedia Cape Verdean Creole
Wikipedia Qeqchi (wp/kek)	wp/kek	Wikipedia Qeqchi
Wikipedia Ket (wp/ket)	wp/ket	Wikipedia Ket
Wikipedia Northwestern Kolami (wp/kfb)	wp/kfb	Wikipedia Northwestern Kolami
Wikipedia Kutchi (wp/kfr)	wp/kfr	Wikipedia Kutchi
Wikipedia Khowar (wp/khw)	wp/khw	Wikipedia Khowar
Wikipedia Sheshi kham (wp/kip)	wp/kip	Wikipedia Sheshi kham
Wikipedia Kirmanjki (wp/kiu)	wp/kiu	Wikipedia Kirmanjki
Wikipedia Khakas (wp/kjh)	wp/kjh	Wikipedia Khakas
Wikipedia Khinalug (wp/kjj)	wp/kjj	Wikipedia Khinalug
Wikipedia Eastern Pwo (wp/kjp)	wp/kjp	Wikipedia Eastern Pwo
Wikipedia Kangean (wp/kkv)	wp/kkv	Wikipedia Kangean
Wikipedia Khorasani Turkish (wp/kmz)	wp/kmz	Wikipedia Khorasani Turkish
Wikipedia Kanuri (wp/kr)	wp/kr	Wikipedia Kanuri
Wikipedia Krio (wp/kri)	wp/kri	Wikipedia Krio
Wikipedia Kinaray-a (wp/krj)	wp/krj	Wikipedia Kinaray-a
Wikipedia Karelian (wp/krl)	wp/krl	Wikipedia Karelian
Wikipedia S'gaw Karen (wp/ksw)	wp/ksw	Wikipedia S'gaw Karen
Wikipedia Eastern Katu (wp/ktv)	wp/ktv	Wikipedia Eastern Katu
Wikipedia Ju'hoan (wp/ktz)	wp/ktz	Wikipedia Ju'hoan
Wikipedia Kumyk (wp/kum)	wp/kum	Wikipedia Kumyk
Wikipedia Kusaal (wp/kus)	wp/kus	Wikipedia Kusaal
Wikipedia Kerinci (wp/kvr)	wp/kvr	Wikipedia Kerinci
Wikipedia Brunei Malay (wp/kxd)	wp/kxd	Wikipedia Brunei Malay
Wikipedia Karuk (wp/kyh)	wp/kyh	Wikipedia Karuk
Wikipedia Pattani (wp/lae)	wp/lae	Wikipedia Pattani
Wikipedia Ladakhi (wp/lbj)	wp/lbj	Wikipedia Ladakhi
Wikipedia Lepcha (wp/lep)	wp/lep	Wikipedia Lepcha
Wikipedia Kaili (wp/lew)	wp/lew	Wikipedia Kaili
Wikipedia Lisu (wp/lis)	wp/lis	Wikipedia Lisu
Wikipedia Livonian (wp/liv)	wp/liv	Wikipedia Livonian
Wikipedia Laki (wp/lki)	wp/lki	Wikipedia Laki
Wikipedia Lakota (wp/lkt)	wp/lkt	Wikipedia Lakota
Wikipedia Peve (wp/lme)	wp/lme	Wikipedia Peve
Wikipedia Northern Luri (wp/lrc)	wp/lrc	Wikipedia Northern Luri
Wikipedia Achomi (wp/lrl)	wp/lrl	Wikipedia Achomi
Wikipedia Luba-Lulua (wp/lua)	wp/lua	Wikipedia Luba-Lulua
Wikipedia Ludic (wp/lud)	wp/lud	Wikipedia Ludic
Wikipedia Dholuo (wp/luo)	wp/luo	Wikipedia Dholuo
Wikipedia Mizo (wp/lus)	wp/lus	Wikipedia Mizo
Wikipedia Lushootseed (wp/lut)	wp/lut	Wikipedia Lushootseed
Wikipedia Southern Luri (wp/luz)	wp/luz	Wikipedia Southern Luri
Wikipedia Laz (wp/lzz)	wp/lzz	Wikipedia Laz
Wikipedia Magahi (wp/mag)	wp/mag	Wikipedia Magahi
Wikipedia Makassarese (wp/mak)	wp/mak	Wikipedia Makassarese
Wikipedia Hassaniya (wp/mey)	wp/mey	Wikipedia Hassaniya
Wikipedia Mauritian Creole (wp/mfe)	wp/mfe	Wikipedia Mauritian Creole
Wikipedia Marshallese (wp/mh)	wp/mh	Wikipedia Marshallese
Wikipedia Mi'kmaq (wp/mic)	wp/mic	Wikipedia Mi'kmaq
Wikipedia Mandaic (wp/mid)	wp/mid	Wikipedia Mandaic
Wikipedia Kupang Malay (wp/mkn)	wp/mkn	Wikipedia Kupang Malay
Wikipedia Manchu (wp/mnc)	wp/mnc	Wikipedia Manchu
Wikipedia Mandinka (wp/mnk)	wp/mnk	Wikipedia Mandinka
Wikipedia Min Bei (wp/mnp)	wp/mnp	Wikipedia Min Bei
Wikipedia Mansi (wp/mns)	wp/mns	Wikipedia Mansi
Wikipedia Innu-aimun (wp/moe)	wp/moe	Wikipedia Innu-aimun
Wikipedia Mohawk (wp/moh)	wp/moh	Wikipedia Mohawk
Wikipedia Mooré (wp/mos)	wp/mos	Wikipedia Mooré
Wikipedia Mara (wp/mrh)	wp/mrh	Wikipedia Mara
Wikipedia Muong (wp/mtq)	wp/mtq	Wikipedia Muong
Wikipedia Musi (wp/mui)	wp/mui	Wikipedia Musi
Wikipedia Inner Mongolian (wp/mvf)	wp/mvf	Wikipedia Inner Mongolian
Wikipedia Miyako (wp/mvi)	wp/mvi	Wikipedia Miyako
Wikipedia Kala Lagaw Ya (wp/mwp)	wp/mwp	Wikipedia Kala Lagaw Ya
Wikipedia Hmong Daw (wp/mww)	wp/mww	Wikipedia Hmong Daw
Wikipedia Mixtec (wp/mxt)	wp/mxt	Wikipedia Mixtec
Wikipedia Macanese Patois (wp/mzs)	wp/mzs	Wikipedia Macanese Patois
Wikipedia Central Huasteca Nahuatl (wp/nch)	wp/nch	Wikipedia Central Huasteca Nahuatl
Wikipedia Classical Nahuatl (wp/nci)	wp/nci	Wikipedia Classical Nahuatl
Wikipedia Northern Puebla Nahuatl (wp/ncj)	wp/ncj	Wikipedia Northern Puebla Nahuatl
Wikipedia Northern Ndebele (wp/nd)	wp/nd	Wikipedia Northern Ndebele
Wikipedia Negidal (wp/neg)	wp/neg	Wikipedia Negidal
Wikipedia Ndonga (wp/ng)	wp/ng	Wikipedia Ndonga
Wikipedia Guerrero Nahuatl (wp/ngu)	wp/ngu	Wikipedia Guerrero Nahuatl
Wikipedia Central Nahuatl (wp/nhn)	wp/nhn	Wikipedia Central Nahuatl
Wikipedia Niuean (wp/niu)	wp/niu	Wikipedia Niuean
Wikipedia Northern Thai (wp/nod)	wp/nod	Wikipedia Northern Thai
Wikipedia Nogai (wp/nog)	wp/nog	Wikipedia Nogai
Wikipedia Southern Ndebele (wp/nr)	wp/nr	Wikipedia Southern Ndebele
Wikipedia Nupe (wp/nup)	wp/nup	Wikipedia Nupe
Wikipedia Nuer (wp/nus)	wp/nus	Wikipedia Nuer
Wikipedia Nkore (wp/nyn)	wp/nyn	Wikipedia Nkore
Wikipedia Noongar (wp/nys)	wp/nys	Wikipedia Noongar
Wikipedia Nzema (wp/nzi)	wp/nzi	Wikipedia Nzema
Wikipedia Orok (wp/oaa)	wp/oaa	Wikipedia Orok
Wikipedia Old Georgian (wp/oge)	wp/oge	Wikipedia Old Georgian
Wikipedia Northwestern Ojibwa (wp/ojb)	wp/ojb	Wikipedia Northwestern Ojibwa
Wikipedia Old Manipuri (wp/omp)	wp/omp	Wikipedia Old Manipuri
Wikipedia Osing (wp/osi)	wp/osi	Wikipedia Osing
Wikipedia Mezquital Otomi (wp/ote)	wp/ote	Wikipedia Mezquital Otomi
Wikipedia Querétaro Otomi (wp/otq)	wp/otq	Wikipedia Querétaro Otomi
Wikipedia Elfdalian (wp/ovd)	wp/ovd	Wikipedia Elfdalian
Wikipedia Palauan (wp/pau)	wp/pau	Wikipedia Palauan
Wikipedia Plautdietsch (wp/pdt)	wp/pdt	Wikipedia Plautdietsch
Wikipedia Pahari-Potwari (wp/phr)	wp/phr	Wikipedia Pahari-Potwari
Wikipedia Solomon Islands Pijin (wp/pis)	wp/pis	Wikipedia Solomon Islands Pijin
Wikipedia Pitjantjatjara (wp/pjt)	wp/pjt	Wikipedia Pitjantjatjara
Wikipedia Pamona (wp/pmf)	wp/pmf	Wikipedia Pamona
Wikipedia Pohnpeian (wp/pon)	wp/pon	Wikipedia Pohnpeian
Wikipedia Polabian (wp/pox)	wp/pox	Wikipedia Polabian
Wikipedia Pipil (wp/ppl)	wp/ppl	Wikipedia Pipil
Wikipedia Prussian (wp/prg)	wp/prg	Wikipedia Prussian
Wikipedia Central Malay (wp/pse)	wp/pse	Wikipedia Central Malay
Wikipedia Puyuma (wp/pyu)	wp/pyu	Wikipedia Puyuma
Wikipedia Pazeh (wp/pzh)	wp/pzh	Wikipedia Pazeh
Wikipedia Kiche (wp/quc)	wp/quc	Wikipedia Kiche
Wikipedia Kichwa (wp/qug)	wp/qug	Wikipedia Kichwa
Wikipedia Ancash Quechua (wp/qwh)	wp/qwh	Wikipedia Ancash Quechua
Wikipedia Qashqai (wp/qxq)	wp/qxq	Wikipedia Qashqai
Wikipedia Rajasthani (wp/raj)	wp/raj	Wikipedia Rajasthani
Wikipedia Rapa Nui (wp/rap)	wp/rap	Wikipedia Rapa Nui
Wikipedia Cook Islands Mori (wp/rar)	wp/rar	Wikipedia Cook Islands Mori
Wikipedia Rawang (wp/raw)	wp/raw	Wikipedia Rawang
Wikipedia Miraya Bikol (wp/rbl)	wp/rbl	Wikipedia Miraya Bikol
Wikipedia Reunion creole (wp/rcf)	wp/rcf	Wikipedia Reunion creole
Wikipedia Rejang (wp/rej)	wp/rej	Wikipedia Rejang
Wikipedia Romagnol (wp/rgn)	wp/rgn	Wikipedia Romagnol
Wikipedia Tarifit (wp/rif)	wp/rif	Wikipedia Tarifit
Wikipedia Rajbanshi (wp/rjs)	wp/rjs	Wikipedia Rajbanshi
Wikipedia Rakhine (wp/rki)	wp/rki	Wikipedia Rakhine
Wikipedia Carpathian Romani (wp/rmc)	wp/rmc	Wikipedia Carpathian Romani
Wikipedia Baltic Romani (wp/rml)	wp/rml	Wikipedia Baltic Romani
Wikipedia Balkan Romani (wp/rmn)	wp/rmn	Wikipedia Balkan Romani
Wikipedia Finnish Kalo (wp/rmf)	wp/rmf	Wikipedia Finnish Kalo
Wikipedia Caló (wp/rmq)	wp/rmq	Wikipedia Caló
Wikipedia (Australian) Kriol (wp/rop)	wp/rop	Wikipedia
Wikipedia Pannonian Rusyn (wp/rsk)	wp/rsk	Wikipedia Pannonian Rusyn
Wikipedia Rotuman (wp/rtm)	wp/rtm	Wikipedia Rotuman
Wikipedia Rutul (wp/rut)	wp/rut	Wikipedia Rutul
Wikipedia Marwari (wp/rwr)	wp/rwr	Wikipedia Marwari
Wikipedia Northern Amami-Oshima (wp/ryn)	wp/ryn	Wikipedia Northern Amami-Oshima
Wikipedia Okinawan (wp/ryu)	wp/ryu	Wikipedia Okinawan
Wikipedia Sassarese (wp/sdc)	wp/sdc	Wikipedia Sassarese
Wikipedia Southern Kurdish (wp/sdh)	wp/sdh	Wikipedia Southern Kurdish
Wikipedia Semai (wp/sea)	wp/sea	Wikipedia Semai
Wikipedia Selkup (wp/sel)	wp/sel	Wikipedia Selkup
Wikipedia Shughni (wp/sgh)	wp/sgh	Wikipedia Shughni
Wikipedia Surgujia (wp/sgj)	wp/sgj	Wikipedia Surgujia
Wikipedia Shoshoni (wp/shh)	wp/shh	Wikipedia Shoshoni
Wikipedia Shipibo (wp/shp)	wp/shp	Wikipedia Shipibo
Wikipedia Shawiya (wp/shy)	wp/shy	Wikipedia Shawiya
Wikipedia Kildin Sami (wp/sjd)	wp/sjd	Wikipedia Kildin Sami
Wikipedia Xibe (wp/sjo)	wp/sjo	Wikipedia Xibe
Wikipedia Ume Sami (wp/sju)	wp/sju	Wikipedia Ume Sami
Wikipedia Lower Silesian (wp/sli)	wp/sli	Wikipedia Lower Silesian
Wikipedia Salar (wp/slr)	wp/slr	Wikipedia Salar
Wikipedia Southern Sami (wp/sma)	wp/sma	Wikipedia Southern Sami
Wikipedia Skolt Sami (wp/sms)	wp/sms	Wikipedia Skolt Sami
Wikipedia Campidanese Sardinian (wp/sro)	wp/sro	Wikipedia Campidanese Sardinian
Wikipedia Thao (wp/ssf)	wp/ssf	Wikipedia Thao
Wikipedia Siberian Tatar (wp/sty)	wp/sty	Wikipedia Siberian Tatar
Wikipedia Hla’alua (wp/sxr)	wp/sxr	Wikipedia Hla’alua
Wikipedia Sylheti (wp/syl)	wp/syl	Wikipedia Sylheti
Wikipedia Tamang (wp/taj)	wp/taj	Wikipedia Tamang
Wikipedia Yami (wp/tao)	wp/tao	Wikipedia Yami
Wikipedia Tai Nüa (wp/tdd)	wp/tdd	Wikipedia Tai Nüa
Wikipedia Tiv (wp/tiv)	wp/tiv	Wikipedia Tiv
Wikipedia Tokelauan (wp/tkl)	wp/tkl	Wikipedia Tokelauan
Wikipedia Tlingit (wp/tli)	wp/tli	Wikipedia Tlingit
Wikipedia Talysh (wp/tly)	wp/tly	Wikipedia Talysh
Wikipedia Jewish Babylonian Aramaic (wp/tmr)	wp/tmr	Wikipedia Jewish Babylonian Aramaic
Wikipedia Tonga (wp/tog)	wp/tog	Wikipedia Tonga
Wikipedia Kokborok (wp/trp)	wp/trp	Wikipedia Kokborok
Wikipedia Tswa (wp/tsc)	wp/tsc	Wikipedia Tswa
Wikipedia Tausug (wp/tsg)	wp/tsg	Wikipedia Tausug
Wikipedia Tsou (wp/tsu)	wp/tsu	Wikipedia Tsou
Wikipedia Isan (wp/tts)	wp/tts	Wikipedia Isan
Wikipedia Tati (wp/ttt)	wp/ttt	Wikipedia Tati
Wikipedia Tucano (wp/tuo)	wp/tuo	Wikipedia Tucano
Wikipedia Tuvaluan (wp/tvl)	wp/tvl	Wikipedia Tuvaluan
Wikipedia Taivoan (wp/tvx)	wp/tvx	Wikipedia Taivoan
Wikipedia Tawang Monpa (wp/twm)	wp/twm	Wikipedia Tawang Monpa
Wikipedia Tày (wp/tyz)	wp/tyz	Wikipedia Tày
Wikipedia Talossan (wp/tzl)	wp/tzl	Wikipedia Talossan
Wikipedia Central Atlas Tamazight (wp/tzm)	wp/tzm	Wikipedia Central Atlas Tamazight
Wikipedia Meriam Mir (wp/ulk)	wp/ulk	Wikipedia Meriam Mir
Wikipedia Unserdeutsch (wp/uln)	wp/uln	Wikipedia Unserdeutsch
Wikipedia Southern Uzbek (wp/uzs)	wp/uzs	Wikipedia Southern Uzbek
Wikipedia Vai (wp/vai)	wp/vai	Wikipedia Vai
Wikipedia Vayu (wp/vay)	wp/vay	Wikipedia Vayu
Wikipedia East Franconian German (wp/vmf)	wp/vmf	Wikipedia East Franconian German
Wikipedia Makhuwa (wp/vmw)	wp/vmw	Wikipedia Makhuwa
Wikipedia Votic (wp/vot)	wp/vot	Wikipedia Votic
Wikipedia Warao (wp/wba)	wp/wba	Wikipedia Warao
Wikipedia Fakauvea (wp/wls)	wp/wls	Wikipedia Fakauvea
Wikipedia Adilabad Gondi (wp/wsg)	wp/wsg	Wikipedia Adilabad Gondi
Wikipedia Wymysorys (wp/wym)	wp/wym	Wikipedia Wymysorys
Wikipedia Manado Malay (wp/xmm)	wp/xmm	Wikipedia Manado Malay
Wikipedia Kanakanavu (wp/xnb)	wp/xnb	Wikipedia Kanakanavu
Wikipedia Mohegan-Pequot (wp/xpq)	wp/xpq	Wikipedia Mohegan-Pequot
Wikipedia Saisiyat (wp/xsy)	wp/xsy	Wikipedia Saisiyat
Wikipedia Kunigami (wp/xug)	wp/xug	Wikipedia Kunigami
Wikipedia Zhang-Zhung (wp/xzh)	wp/xzh	Wikipedia Zhang-Zhung
Wikipedia Yaghnobi (wp/yai)	wp/yai	Wikipedia Yaghnobi
Wikipedia Yapese (wp/yap)	wp/yap	Wikipedia Yapese
Wikipedia Western Yugur (wp/ybe)	wp/ybe	Wikipedia Western Yugur
Wikipedia Gepo (wp/ygp)	wp/ygp	Wikipedia Gepo
Wikipedia Yonaguni (wp/yoi)	wp/yoi	Wikipedia Yonaguni
Wikipedia Yoron (wp/yox)	wp/yox	Wikipedia Yoron
Wikipedia Nenets (wp/yrk)	wp/yrk	Wikipedia Nenets
Wikipedia Nheengatu (wp/yrl)	wp/yrl	Wikipedia Nheengatu
Wikipedia Yucatec Maya (wp/yua)	wp/yua	Wikipedia Yucatec Maya
Wikipedia Isthmus Zapotec (wp/zai)	wp/zai	Wikipedia Isthmus Zapotec
Wikipedia Zapotec (wp/zap)	wp/zap	Wikipedia Zapotec
Wikipedia Eastern Hongshuihe Zhuang (wp/zeh)	wp/zeh	Wikipedia Eastern Hongshuihe Zhuang
Wikipedia Moroccan Amazigh (wp/zgh)	wp/zgh	Wikipedia Moroccan Amazigh
Wikiquote Ainu (wq/ain)	wq/ain	Wikiquote Ainu
Wikiquote Assamese (wq/as)	wq/as	Wikiquote Assamese
Wikiquote Asturian (wq/ast)	wq/ast	Wikiquote Asturian
Wikiquote Avar (wq/av)	wq/av	Wikiquote Avar
Wikiquote South Azerbaijani (wq/azb)	wq/azb	Wikiquote South Azerbaijani
Wikiquote Bashkir (wq/ba)	wq/ba	Wikiquote Bashkir
Wikiquote Banjar (wq/bjn)	wq/bjn	Wikiquote Banjar
Wikiquote Bambara (wq/bm)	wq/bm	Wikiquote Bambara
Wikiquote Central Kurdish (wq/ckb)	wq/ckb	Wikiquote Central Kurdish
Wikiquote Chittagonian (wq/ctg)	wq/ctg	Wikiquote Chittagonian
Wikiquote Zazaki (wq/diq)	wq/diq	Wikiquote Zazaki
Wikiquote Dzongka (wq/dz)	wq/dz	Wikiquote Dzongka
Wikiquote Fijian (wq/fj)	wq/fj	Wikiquote Fijian
Wikiquote Gilaki (wq/glk)	wq/glk	Wikiquote Gilaki
Wikiquote Ancient Greek (wq/grc)	wq/grc	Wikiquote Ancient Greek
Wikiquote Gungbe (wq/guw)	wq/guw	Wikiquote Gungbe
Wikiquote Hausa (wq/ha)	wq/ha	Wikiquote Hausa
Wikiquote Fiji Hindi (wq/hif)	wq/hif	Wikiquote Fiji Hindi
Wikiquote Haitian Creole (wq/ht)	wq/ht	Wikiquote Haitian Creole
Wikiquote Jatki (wq/jat)	wq/jat	Wikiquote Jatki
Wikiquote Javanese (wq/jv)	wq/jv	Wikiquote Javanese
Wikiquote Karakalpak (wq/kaa)	wq/kaa	Wikiquote Karakalpak
Wikiquote Tyap (wq/kcg)	wq/kcg	Wikiquote Tyap
Wikiquote Kanuri (wq/kr)	wq/kr	Wikiquote Kanuri
Wikiquote Latvian (wq/lv)	wq/lv	Wikiquote Latvian
Wikiquote Literary Chinese (wq/lzh)	wq/lzh	Wikiquote Literary Chinese
Wikiquote Minangkabau (wq/min)	wq/min	Wikiquote Minangkabau
Wikiquote Macedonian (wq/mk)	wq/mk	Wikiquote Macedonian
Wikiquote Malay (wq/ms)	wq/ms	Wikiquote Malay
Wikiquote Multilingual (wq/mul)	wq/mul	Wikiquote Multilingual
Wikiquote Burmese (wq/my)	wq/my	Wikiquote Burmese
Wikiquote Mazandarani (wq/mzn)	wq/mzn	Wikiquote Mazandarani
Wikiquote Nepali (wq/ne)	wq/ne	Wikiquote Nepali
Wikiquote Nias (wq/nia)	wq/nia	Wikiquote Nias
Wikiquote Oromo (wq/om)	wq/om	Wikiquote Oromo
Wikiquote Oriya (wq/or)	wq/or	Wikiquote Oriya
Wikiquote Punjabi (wq/pa)	wq/pa	Wikiquote Punjabi
Wikiquote Western Panjabi (wq/pnb)	wq/pnb	Wikiquote Western Panjabi
Wikiquote Pashto (wq/ps)	wq/ps	Wikiquote Pashto
Wikiquote Kinyarwanda (wq/rw)	wq/rw	Wikiquote Kinyarwanda
Wikiquote Santali (wq/sat)	wq/sat	Wikiquote Santali
Wikiquote Serbo-Croatian (wq/sh)	wq/sh	Wikiquote Serbo-Croatian
Wikiquote Sinhala (wq/si)	wq/si	Wikiquote Sinhala
Wikiquote Saraiki (wq/skr)	wq/skr	Wikiquote Saraiki
Wikiquote Swahili (wq/sw)	wq/sw	Wikiquote Swahili
Wikiquote Sylheti (wq/syl)	wq/syl	Wikiquote Sylheti
Wikiquote Tswana (wq/tn)	wq/tn	Wikiquote Tswana
Wikiquote Tatar (wq/tt)	wq/tt	Wikiquote Tatar
Wikiquote Tumbuka (wq/tum)	wq/tum	Wikiquote Tumbuka
Wikiquote Cantonese (wq/yue)	wq/yue	Wikiquote Cantonese
Wikivoyage Afrikaans (wy/af)	wy/af	Wikivoyage Afrikaans
Wikivoyage Arabic (wy/ar)	wy/ar	Wikivoyage Arabic
Wikivoyage Azerbaijani (wy/az)	wy/az	Wikivoyage Azerbaijani
Wikivoyage South Azerbaijani (wy/azb)	wy/azb	Wikivoyage South Azerbaijani
Wikivoyage Belarusian (wy/be)	wy/be	Wikivoyage Belarusian
Wikivoyage Bulgarian (wy/bg)	wy/bg	Wikivoyage Bulgarian
Wikivoyage Catalan (wy/ca)	wy/ca	Wikivoyage Catalan
Wikivoyage Czech (wy/cs)	wy/cs	Wikivoyage Czech
Wikivoyage Chittagonian (wy/ctg)	wy/ctg	Wikivoyage Chittagonian
Wikivoyage Danish (wy/da)	wy/da	Wikivoyage Danish
Wikivoyage Dagbani (wy/dag)	wy/dag	Wikivoyage Dagbani
Wikivoyage Zazaki (wy/diq)	wy/diq	Wikivoyage Zazaki
Wikivoyage Basque (wy/eu)	wy/eu	Wikivoyage Basque
Wikivoyage Fijian (wy/fj)	wy/fj	Wikivoyage Fijian
Wikivoyage Hausa (wy/ha)	wy/ha	Wikivoyage Hausa
Wikivoyage Serbo-Croatian (wy/hbs)	wy/hbs	Wikivoyage Serbo-Croatian
Wikivoyage Fiji Hindi (wy/hif)	wy/hif	Wikivoyage Fiji Hindi
Wikivoyage Hungarian (wy/hu)	wy/hu	Wikivoyage Hungarian
Wikivoyage Armenian (wy/hy)	wy/hy	Wikivoyage Armenian
Wikivoyage Indonesian (wy/id)	wy/id	Wikivoyage Indonesian
Wikivoyage Jatki (wy/jat)	wy/jat	Wikivoyage Jatki
Wikivoyage Georgian (wy/ka)	wy/ka	Wikivoyage Georgian
Wikivoyage Kazakh (wy/kk)	wy/kk	Wikivoyage Kazakh
Wikivoyage Korean (wy/ko)	wy/ko	Wikivoyage Korean
Wikivoyage Latin (wy/la)	wy/la	Wikivoyage Latin
Wikivoyage Lao (wy/lo)	wy/lo	Wikivoyage Lao
Wikivoyage Latvian (wy/lv)	wy/lv	Wikivoyage Latvian
Wikivoyage Maori (wy/mi)	wy/mi	Wikivoyage Maori
Wikivoyage Malayalam (wy/ml)	wy/ml	Wikivoyage Malayalam
Wikivoyage Manchu (wy/mnc)	wy/mnc	Wikivoyage Manchu
Wikivoyage Meitei (wy/mni)	wy/mni	Wikivoyage Meitei
Wikivoyage Mon (wy/mnw)	wy/mnw	Wikivoyage Mon
Wikivoyage Marathi (wy/mr)	wy/mr	Wikivoyage Marathi
Wikivoyage Malay (wy/ms)	wy/ms	Wikivoyage Malay
Wikivoyage Maltese (wy/mt)	wy/mt	Wikivoyage Maltese
Wikivoyage Burmese (wy/my)	wy/my	Wikivoyage Burmese
Wikivoyage Norwegian Bokmål (wy/nb)	wy/nb	Wikivoyage Norwegian Bokmål
Wikivoyage Rusyn (wy/rue)	wy/rue	Wikivoyage Rusyn
Wikivoyage Okinawan (wy/ryu)	wy/ryu	Wikivoyage Okinawan
Wikivoyage Santali (wy/sat)	wy/sat	Wikivoyage Santali
Wikivoyage Tachelhit (wy/shi)	wy/shi	Wikivoyage Tachelhit
Wikivoyage Slovak (wy/sk)	wy/sk	Wikivoyage Slovak
Wikivoyage Saraiki (wy/skr)	wy/skr	Wikivoyage Saraiki
Wikivoyage Somali (wy/so)	wy/so	Wikivoyage Somali
Wikivoyage Serbian (wy/sr)	wy/sr	Wikivoyage Serbian
Wikivoyage Swahili (wy/sw)	wy/sw	Wikivoyage Swahili
Wikivoyage Sylheti (wy/syl)	wy/syl	Wikivoyage Sylheti
Wikivoyage Tamil (wy/ta)	wy/ta	Wikivoyage Tamil
Wikivoyage Thai (wy/th)	wy/th	Wikivoyage Thai
Wikivoyage Turkmen (wy/tk)	wy/tk	Wikivoyage Turkmen
Wikivoyage Tatar (wy/tt)	wy/tt	Wikivoyage Tatar
Wikivoyage Tumbuka (wy/tum)	wy/tum	Wikivoyage Tumbuka
Wikivoyage Urdu (wy/ur)	wy/ur	Wikivoyage Urdu
Wikivoyage Wu (wy/wuu)	wy/wuu	Wikivoyage Wu
Wikivoyage Cantonese (wy/yue)	wy/yue	Wikivoyage Cantonese
Wiktionary Abkhaz (wt/ab)	wt/ab	Wiktionary Abkhaz
Wiktionary Acehnese (wt/ace)	wt/ace	Wiktionary Acehnese
Wiktionary Ainu (wt/ain)	wt/ain	Wiktionary Ainu
Wiktionary Algerian Arabic (wt/arq)	wt/arq	Wiktionary Algerian Arabic
Wiktionary Moroccan Arabic (wt/ary)	wt/ary	Wiktionary Moroccan Arabic
Wiktionary Egyptian Arabic (wt/arz)	wt/arz	Wiktionary Egyptian Arabic
Wiktionary Assamese (wt/as)	wt/as	Wiktionary Assamese
Wiktionary Avar (wt/av)	wt/av	Wiktionary Avar
Wiktionary Awadhi (wt/awa)	wt/awa	Wiktionary Awadhi
Wiktionary South Azerbaijani (wt/azb)	wt/azb	Wiktionary South Azerbaijani
Wiktionary Bashkir (wt/ba)	wt/ba	Wiktionary Bashkir
Wiktionary Balinese (wt/ban)	wt/ban	Wiktionary Balinese
Wiktionary Bhojpuri (wt/bho)	wt/bho	Wiktionary Bhojpuri
Wiktionary Pa'O (wt/blk)	wt/blk	Wiktionary Pa'O
Wiktionary Bambara (wt/bm)	wt/bm	Wiktionary Bambara
Wiktionary Bunun (wt/bnn)	wt/bnn	Wiktionary Bunun
Wiktionary Tibetan (wt/bo)	wt/bo	Wiktionary Tibetan
Wiktionary Mandailing (wt/btm)	wt/btm	Wiktionary Mandailing
Wiktionary Rinconada (wt/bto)	wt/bto	Wiktionary Rinconada
Wiktionary Buginese (wt/bug)	wt/bug	Wiktionary Buginese
Wiktionary Chavacano (wt/cbk)	wt/cbk	Wiktionary Chavacano
Wiktionary Min Dong (wt/cdo)	wt/cdo	Wiktionary Min Dong
Wiktionary Cebuano (wt/ceb)	wt/ceb	Wiktionary Cebuano
Wiktionary Central Kurdish (wt/ckb)	wt/ckb	Wiktionary Central Kurdish
Wiktionary Pu-Xian Min (wt/cpx)	wt/cpx	Wiktionary Pu-Xian Min
Wiktionary Crimean Tatar (wt/crh)	wt/crh	Wiktionary Crimean Tatar
Wiktionary Central Sierra Miwok (wt/csm)	wt/csm	Wiktionary Central Sierra Miwok
Wiktionary Chittagonian (wt/ctg)	wt/ctg	Wiktionary Chittagonian
Wiktionary Old Church Slavonic (wt/cu)	wt/cu	Wiktionary Old Church Slavonic
Wiktionary Chuvash (wt/cv)	wt/cv	Wiktionary Chuvash
Wiktionary Slavey (wt/den)	wt/den	Wiktionary Slavey
Wiktionary Dogri (wt/dgo)	wt/dgo	Wiktionary Dogri
Wiktionary Doteli (wt/dty)	wt/dty	Wiktionary Doteli
Wiktionary Ewe (wt/ee)	wt/ee	Wiktionary Ewe
Wiktionary Emilian (wt/egl)	wt/egl	Wiktionary Emilian
Wiktionary Even (wt/eve)	wt/eve	Wiktionary Even
Wiktionary Evenki (wt/evn)	wt/evn	Wiktionary Evenki
Wiktionary Meänkieli (wt/fit)	wt/fit	Wiktionary Meänkieli
Wiktionary Arpitan (wt/frp)	wt/frp	Wiktionary Arpitan
Wiktionary Gagauz (wt/gag)	wt/gag	Wiktionary Gagauz
Wiktionary Gan (wt/gan)	wt/gan	Wiktionary Gan
Wiktionary Nanai (wt/gld)	wt/gld	Wiktionary Nanai
Wiktionary Gilaki (wt/glk)	wt/glk	Wiktionary Gilaki
Wiktionary Gorontalo (wt/gor)	wt/gor	Wiktionary Gorontalo
Wiktionary Gothic (wt/got)	wt/got	Wiktionary Gothic
Wiktionary Ancient Greek (wt/grc)	wt/grc	Wiktionary Ancient Greek
Wiktionary Wayuu (wt/guc)	wt/guc	Wiktionary Wayuu
Wiktionary Hakka (wt/hak)	wt/hak	Wiktionary Hakka
Wiktionary Hawaiian (wt/haw)	wt/haw	Wiktionary Hawaiian
Wiktionary Ho (wt/hoc)	wt/hoc	Wiktionary Ho
Wiktionary Haitian Creolen (wt/ht)	wt/ht	Wiktionary Haitian Creolen
Wiktionary Inupiaq (wt/ik)	wt/ik	Wiktionary Inupiaq
Wiktionary Jamaican Patois (wt/jam)	wt/jam	Wiktionary Jamaican Patois
Wiktionary Jatki (wt/jat)	wt/jat	Wiktionary Jatki
Wiktionary Jeju (wt/jje)	wt/jje	Wiktionary Jeju
Wiktionary Jutlandic (wt/jut)	wt/jut	Wiktionary Jutlandic
Wiktionary Kabyle (wt/kab)	wt/kab	Wiktionary Kabyle
Wiktionary Kabardian (wt/kbd)	wt/kbd	Wiktionary Kabardian
Wiktionary Tyap (wt/kcg)	wt/kcg	Wiktionary Tyap
Wiktionary Khowar (wt/khw)	wt/khw	Wiktionary Khowar
Wiktionary Kikuyu (wt/ki)	wt/ki	Wiktionary Kikuyu
Wiktionary Kirmanjki (wt/kiu)	wt/kiu	Wiktionary Kirmanjki
Wiktionary Khakas (wt/kjh)	wt/kjh	Wiktionary Khakas
Wiktionary Krio (wt/kri)	wt/kri	Wiktionary Krio
Wiktionary Eastern Pwo (wt/kjp)	wt/kjp	Wiktionary Eastern Pwo
Wiktionary Colognian (wt/ksh)	wt/ksh	Wiktionary Colognian
Wiktionary Judaeo-Spanish (Ladino) (wt/lad)	wt/lad	Wiktionary Judaeo-Spanish
Wiktionary Rangi (wt/lag)	wt/lag	Wiktionary Rangi
Wiktionary Lingua Franca Nova (wt/lfn)	wt/lfn	Wiktionary Lingua Franca Nova
Wiktionary Ligurian (wt/lij)	wt/lij	Wiktionary Ligurian
Wiktionary Laki (wt/lki)	wt/lki	Wiktionary Laki
Wiktionary Lozi (wt/loz)	wt/loz	Wiktionary Lozi
Wiktionary Latgalian (wt/ltg)	wt/ltg	Wiktionary Latgalian
Wiktionary Southern Luri (wt/luz)	wt/luz	Wiktionary Southern Luri
Wiktionary Lavukaleve (wt/lvk)	wt/lvk	Wiktionary Lavukaleve
Wiktionary Laz (wt/lzz)	wt/lzz	Wiktionary Laz
Wiktionary Moksha (wt/mdf)	wt/mdf	Wiktionary Moksha
Wiktionary Motu (wt/meu)	wt/meu	Wiktionary Motu
Wiktionary Marshallese (wt/mh)	wt/mh	Wiktionary Marshallese
Wiktionary Eastern Mari (wt/mhr)	wt/mhr	Wiktionary Eastern Mari
Wiktionary Manchu (wt/mnc)	wt/mnc	Wiktionary Manchu
Wiktionary Mirandese (wt/mwl)	wt/mwl	Wiktionary Mirandese
Wiktionary Erzya (wt/myv)	wt/myv	Wiktionary Erzya
Wiktionary Mazandarani (wt/mzn)	wt/mzn	Wiktionary Mazandarani
Wiktionary Neapolitan (wt/nap)	wt/nap	Wiktionary Neapolitan
Wiktionary Negidal (wt/neg)	wt/neg	Wiktionary Negidal
Wiktionary Nepal Bhasa (wt/new)	wt/new	Wiktionary Nepal Bhasa
Wiktionary Novial (wt/nov)	wt/nov	Wiktionary Novial
Wiktionary Norman (wt/nrf)	wt/nrf	Wiktionary Norman
Wiktionary Northern Sotho (wt/nso)	wt/nso	Wiktionary Northern Sotho
Wiktionary Orok (wt/oaa)	wt/oaa	Wiktionary Orok
Wiktionary Oroch (wt/oac)	wt/oac	Wiktionary Oroch
Wiktionary Old Dutch (wt/odt)	wt/odt	Wiktionary Old Dutch
Wiktionary Livvi-Karelian (wt/olo)	wt/olo	Wiktionary Livvi-Karelian
Wiktionary Oroqen (wt/orh)	wt/orh	Wiktionary Oroqen
Wiktionary Pangasinan (wt/pag)	wt/pag	Wiktionary Pangasinan
Wiktionary Middle Persian (wt/pal)	wt/pal	Wiktionary Middle Persian
Wiktionary Pampanga (wt/pam)	wt/pam	Wiktionary Pampanga
Wiktionary Papiamento (wt/pap)	wt/pap	Wiktionary Papiamento
Wiktionary Picard (wt/pcd)	wt/pcd	Wiktionary Picard
Wiktionary Nigerian Pidgin (wt/pcm)	wt/pcm	Wiktionary Nigerian Pidgin
Wiktionary Pitjantjatjara (wt/pjt)	wt/pjt	Wiktionary Pitjantjatjara
Wiktionary Piedmontese (wt/pms)	wt/pms	Wiktionary Piedmontese
Wiktionary Polabian (wt/pox)	wt/pox	Wiktionary Polabian
Wiktionary Paiwan (wt/pwn)	wt/pwn	Wiktionary Paiwan
Wiktionary Ancash Quechua (wt/qwh)	wt/qwh	Wiktionary Ancash Quechua
Wiktionary Rawang (wt/raw)	wt/raw	Wiktionary Rawang
Wiktionary Arakanese (wt/rki)	wt/rki	Wiktionary Arakanese
Wiktionary Carpathian Romani (wt/rmc)	wt/rmc	Wiktionary Carpathian Romani
Wiktionary Baltic Romani (wt/rml)	wt/rml	Wiktionary Baltic Romani
Wiktionary Rusyn (wt/rue)	wt/rue	Wiktionary Rusyn
Wiktionary Okinawan (wt/ryu)	wt/ryu	Wiktionary Okinawan
Wiktionary Sakha (wt/sah)	wt/sah	Wiktionary Sakha
Wiktionary Sasak (wt/sas)	wt/sas	Wiktionary Sasak
Wiktionary Santali (wt/sat)	wt/sat	Wiktionary Santali
Wiktionary Saurashtra (wt/saz)	wt/saz	Wiktionary Saurashtra
Wiktionary Sardinian (wt/sc)	wt/sc	Wiktionary Sardinian
Wiktionary Scots (wt/sco)	wt/sco	Wiktionary Scots
Wiktionary Northern Sami (wt/se)	wt/se	Wiktionary Northern Sami
Wiktionary Thao (wt/ssf)	wt/ssf	Wiktionary Thao
Wiktionary Sylheti (wt/syl)	wt/syl	Wiktionary Sylheti
Wiktionary Silesian (wt/szl)	wt/szl	Wiktionary Silesian
Wiktionary Sakizaya (wt/szy)	wt/szy	Wiktionary Sakizaya
Wiktionary Yami (wt/tao)	wt/tao	Wiktionary Yami
Wiktionary Tulu (wt/tcy)	wt/tcy	Wiktionary Tulu
Wiktionary Talysh (wt/tly)	wt/tly	Wiktionary Talysh
Wiktionary Seediq (wt/trv)	wt/trv	Wiktionary Seediq
Wiktionary Tumbuka (wt/tum)	wt/tum	Wiktionary Tumbuka
Wiktionary Tahitian (wt/ty)	wt/ty	Wiktionary Tahitian
Wiktionary Udege (wt/ude)	wt/ude	Wiktionary Udege
Wiktionary Ulch (wt/ulc)	wt/ulc	Wiktionary Ulch
Wiktionary Veps (wt/vep)	wt/vep	Wiktionary Veps
Wiktionary Waray-Waray (wt/war)	wt/war	Wiktionary Waray-Waray
Wiktionary Adilabad Gondi (wt/wsg)	wt/wsg	Wiktionary Adilabad Gondi
Wiktionary Wu Chinese (wt/wuu)	wt/wuu	Wiktionary Wu Chinese
Wiktionary Xhosa (wt/xh)	wt/xh	Wiktionary Xhosa
Wiktionary Mingrelian (wt/xmf)	wt/xmf	Wiktionary Mingrelian
Wiktionary Yoruba (wt/yo)	wt/yo	Wiktionary Yoruba
Wiktionary Nheengatu (wt/yrl)	wt/yrl	Wiktionary Nheengatu
Wiktionary Zhuang (wt/za)	wt/za	Wiktionary Zhuang
Wiktionary Zeelandic (wt/zea)	wt/zea	Wiktionary Zeelandic
Wiktionary Standard Moroccan Tamazight (wt/zgh)	wt/zgh	Wiktionary Standard Moroccan Tamazight