dbname	template	page_id	page_title	l2_heading	num_definitions	num_templates	templates
thwiktionary	misspelling_of	10419	กิเลษ	ภาษาไทย	1	1	[('คำนาม', 'th', 'กิเลส')]
thwiktionary	misspelling_of	16045	กรู	ภาษาไทย	3	1	[('คำสรรพนาม', 'th', 'กู')]
thwiktionary	misspelling_of	16156	กระเหรี่ยง	ภาษาไทย	1	1	[('คำวิสามานยนาม', 'th', 'กะเหรี่ยง')]
thwiktionary	misspelling_of	19268	คับ	ภาษาไทย	3	1	[('คำอนุภาค', 'th', 'ครับ')]
thwiktionary	misspelling_of	24191	มัสยา	ภาษาไทย	1	1	[('คำนาม', 'th', 'มัตสยา')]
thwiktionary	misspelling_of	24572	คธา	ภาษาไทย	1	1	[('คำนาม', 'th', 'คทา')]
thwiktionary	misspelling_of	30707	ลิงค์	ภาษาไทย	4	1	[('คำนาม', 'th', 'ลิงก์')]
thwiktionary	misspelling_of	32177	เซ็ง	ภาษาไทย	3	1	[('คำกริยา', 'th', 'เซ้ง')]
thwiktionary	misspelling_of	33759	เพ็ชร	ภาษาไทย	2	1	[('คำนาม', 'th', 'เพชร')]
thwiktionary	misspelling_of	34007	แซ็ว	ภาษาไทย	1	1	[('คำกริยา', 'th', 'แซว')]
thwiktionary	misspelling_of	34193	สตูว์	ภาษาไทย	1	1	[('คำนาม', 'th', 'สตู')]
thwiktionary	misspelling_of	34241	น๊อต	ภาษาไทย	1	1	[('คำนาม', 'th', 'นอต')]
thwiktionary	misspelling_of	34243	น้อต	ภาษาไทย	1	1	[('คำนาม', 'th', 'นอต')]
thwiktionary	misspelling_of	34290	คริสตศาสนิกชน	ภาษาไทย	1	1	[('คำนาม', 'th', 'คริสต์ศาสนิกชน')]
thwiktionary	misspelling_of	34291	คริสตศักราช	ภาษาไทย	1	1	[('คำวิสามานยนาม', 'th', 'คริสต์ศักราช')]
thwiktionary	misspelling_of	34293	คริสตศตวรรษ	ภาษาไทย	1	1	[('คำนาม', 'th', 'คริสต์ศตวรรษ')]
thwiktionary	misspelling_of	34332	ผัดไท	ภาษาไทย	1	1	[('คำนาม', 'th', 'ผัดไทย')]
thwiktionary	misspelling_of	34333	ผัดกระเพรา	ภาษาไทย	1	1	[('คำนาม', 'th', 'ผัดกะเพรา')]
thwiktionary	misspelling_of	34334	ผัดกระเพา	ภาษาไทย	1	1	[('คำนาม', 'th', 'ผัดกะเพรา')]
thwiktionary	misspelling_of	34335	ผัดกะเพา	ภาษาไทย	1	1	[('คำนาม', 'th', 'ผัดกะเพรา')]
thwiktionary	misspelling_of	34807	นัยยะ	ภาษาไทย	1	1	[('คำนาม', 'th', 'นัย')]
thwiktionary	misspelling_of	34824	ม๊อบ	ภาษาไทย	1	1	[('คำนาม', 'th', 'ม็อบ')]
thwiktionary	misspelling_of	35112	ใฝ	ภาษาไทย	1	1	[('คำนาม', 'th', 'ไฝ')]
thwiktionary	misspelling_of	35113	ใส้	ภาษาไทย	1	1	[('คำนาม', 'th', 'ไส้')]
thwiktionary	misspelling_of	35114	ลำใส้	ภาษาไทย	1	1	[('คำนาม', 'th', 'ลำไส้')]
thwiktionary	misspelling_of	35443	ทะโมน	ภาษาไทย	1	1	[('คำคุณศัพท์', 'th', 'ทโมน')]
thwiktionary	misspelling_of	35445	ทะยอย	ภาษาไทย	2	2	[('คำกริยาวิเศษณ์', 'th', 'ทยอย'), ('คำนาม', 'th', 'ทยอย')]
thwiktionary	misspelling_of	35774	กิเลศ	ภาษาไทย	2	1	[('คำนาม', 'th', 'กิเลส')]
thwiktionary	misspelling_of	35825	ศรีษะ	ภาษาไทย	1	1	[('คำนาม', 'th', 'ศีรษะ')]
thwiktionary	misspelling_of	36924	สุกขี	ภาษาไทย	2	2	[('คำนาม', 'th', 'สุขี'), ('คำคุณศัพท์', 'th', 'สุขี')]
thwiktionary	misspelling_of	36925	สุขขี	ภาษาไทย	2	2	[('คำนาม', 'th', 'สุขี'), ('คำคุณศัพท์', 'th', 'สุขี')]
thwiktionary	misspelling_of	45880	〇	ภาษาญี่ปุ่น	2	1	[('สัญลักษณ์', 'ja', '○')]
thwiktionary	misspelling_of	48009	se	ภาษาสเปน	8	1	[('คำกริยา', 'es', 'sé')]
thwiktionary	misspelling_of	48073	สตรอเบอร์รี่	ภาษาไทย	2	2	[('คำนาม', 'th', 'สตรอว์เบอร์รี'), ('คำกริยา', 'th', 'สตรอว์เบอร์รี')]
thwiktionary	misspelling_of	48498	กบฎ	ภาษาไทย	1	1	[('คำนาม', 'th', 'กบฏ')]
thwiktionary	misspelling_of	51250	Тайланд	ภาษารัสเซีย	1	1	[('คำวิสามานยนาม', 'ru', 'Таила́нд')]
thwiktionary	misspelling_of	136348	ชิบหาย	ภาษาไทย	1	1	[('คำกริยา', 'th', 'ฉิบหาย')]
thwiktionary	misspelling_of	138398	ลื้อ	ภาษาไทย	4	1	[('คำกริยา', 'th', 'รื้อ')]
thwiktionary	misspelling_of	138404	กฏ	ภาษาไทย	2	2	[('คำนาม', 'th', 'กฎ'), ('คำกริยา', 'th', 'กฎ')]
thwiktionary	misspelling_of	138407	กระเพา	ภาษาไทย	1	1	[('คำนาม', 'th', 'กะเพรา')]
thwiktionary	misspelling_of	138408	กระเพรา	ภาษาไทย	1	1	[('คำนาม', 'th', 'กะเพรา')]
thwiktionary	misspelling_of	138410	กะเพา	ภาษาไทย	1	1	[('คำนาม', 'th', 'กะเพรา')]
thwiktionary	misspelling_of	138412	ความสุกขี	ภาษาไทย	1	1	[('คำนาม', 'th', 'ความสุขี')]
thwiktionary	misspelling_of	138413	ความสุขขี	ภาษาไทย	1	1	[('คำนาม', 'th', 'ความสุขี')]
thwiktionary	misspelling_of	138855	ประนาม	ภาษาไทย	1	1	[('คำกริยา', 'th', 'ประณาม')]
thwiktionary	misspelling_of	138860	เณรคุณ	ภาษาไทย	1	1	[('คำกริยา', 'th', 'เนรคุณ')]
thwiktionary	misspelling_of	138925	อินฟาเรด	ภาษาไทย	1	1	[('คำนาม', 'th', 'อินฟราเรด')]
thwiktionary	misspelling_of	139010	ไตรยางค์	ภาษาไทย	1	1	[('คำนาม', 'th', 'ไตรยางศ์')]
thwiktionary	misspelling_of	139405	แก๊ซ	ภาษาไทย	1	1	[('คำนาม', 'th', 'แก๊ส')]
thwiktionary	misspelling_of	139406	แก็ส	ภาษาไทย	1	1	[('คำนาม', 'th', 'แก๊ส')]
thwiktionary	misspelling_of	139407	แก็ซ	ภาษาไทย	1	1	[('คำนาม', 'th', 'แก๊ส')]
thwiktionary	misspelling_of	139434	ปราศัย	ภาษาไทย	2	2	[('คำนาม', 'th', 'ปราศรัย'), ('คำกริยา', 'th', 'ปราศรัย')]
thwiktionary	misspelling_of	139462	ฟิลิปดา	ภาษาไทย	1	1	[('คำนาม', 'th', 'พิลิปดา')]
thwiktionary	misspelling_of	140887	คำภีร์	ภาษาไทย	1	1	[('คำนาม', 'th', 'คัมภีร์')]
thwiktionary	misspelling_of	141195	กระหล่ำ	ภาษาไทย	1	1	[('คำนาม', 'th', 'กะหล่ำ')]
thwiktionary	misspelling_of	141301	ฆ้อน	ภาษาไทย	1	1	[('คำนาม', 'th', 'ค้อน')]
thwiktionary	misspelling_of	144495	ตำหรับ	ภาษาไทย	1	1	[('คำนาม', 'th', 'ตำรับ')]
thwiktionary	misspelling_of	146521	เคียด	ภาษาไทย	2	1	[('คำคุณศัพท์', 'th', 'เครียด')]
thwiktionary	misspelling_of	147176	บิณฑบาตร	ภาษาไทย	4	2	[('คำนาม', 'th', 'บิณฑบาต'), ('คำกริยา', 'th', 'บิณฑบาต')]
thwiktionary	misspelling_of	147358	ระแวก	ภาษาไทย	1	1	[('คำนาม', 'th', 'ละแวก')]
thwiktionary	misspelling_of	147431	ลำคาน	ภาษาไทย	1	1	[('คำกริยา', 'th', 'รำคาญ')]
thwiktionary	misspelling_of	147432	ลำคาญ	ภาษาไทย	1	1	[('คำกริยา', 'th', 'รำคาญ')]
thwiktionary	misspelling_of	147435	เทอ	ภาษาไทย	1	1	[('คำสรรพนาม', 'th', 'เธอ')]
thwiktionary	misspelling_of	147497	ปราชญา	ภาษาไทย	2	2	[('คำนาม', 'th', 'ปรัชญา'), ('คำนาม', 'th', 'ปราชญ์')]
thwiktionary	misspelling_of	147972	สพรั่ง	ภาษาไทย	1	1	[('คำกริยาวิเศษณ์', 'th', 'สะพรั่ง')]
thwiktionary	misspelling_of	147983	ฟอร์มาลีน	ภาษาไทย	1	1	[('คำนาม', 'th', 'ฟอร์มาลิน')]
thwiktionary	misspelling_of	149092	ประจาร	ภาษาไทย	1	1	[('คำกริยา', 'th', 'ประจาน')]
thwiktionary	misspelling_of	149094	สันดาร	ภาษาไทย	1	1	[('คำนาม', 'th', 'สันดาน')]
thwiktionary	misspelling_of	149096	สีสรร	ภาษาไทย	1	1	[('คำนาม', 'th', 'สีสัน')]
thwiktionary	misspelling_of	149120	marketting	ภาษาอังกฤษ	2	1	[('คำกริยา', 'en', 'marketing')]
thwiktionary	misspelling_of	149121	begining	ภาษาอังกฤษ	2	2	[('คำกริยา', 'en', 'beginning'), ('คำนาม', 'en', 'beginning')]
thwiktionary	misspelling_of	149124	langauge	ภาษาอังกฤษ	1	1	[('คำนาม', 'en', 'language')]
thwiktionary	misspelling_of	149125	nineth	ภาษาอังกฤษ	1	1	[('เลข', 'en', 'ninth')]
thwiktionary	misspelling_of	149126	seperate	ภาษาอังกฤษ	2	2	[('คำคุณศัพท์', 'en', 'separate'), ('คำกริยา', 'en', 'separate')]
thwiktionary	misspelling_of	149127	seperation	ภาษาอังกฤษ	1	1	[('คำนาม', 'en', 'separation')]
thwiktionary	misspelling_of	149128	masterbate	ภาษาอังกฤษ	1	1	[('คำกริยา', 'en', 'masturbate')]
thwiktionary	misspelling_of	149129	masterbation	ภาษาอังกฤษ	1	1	[('คำนาม', 'en', 'masturbation')]
thwiktionary	misspelling_of	149130	amature	ภาษาอังกฤษ	2	2	[('คำนาม', 'en', 'amateur'), ('คำนาม', 'en', 'armature')]
thwiktionary	misspelling_of	149131	compatable	ภาษาอังกฤษ	1	1	[('คำคุณศัพท์', 'en', 'compatible')]
thwiktionary	misspelling_of	149132	hilight	ภาษาอังกฤษ	2	2	[('คำนาม', 'en', 'highlight'), ('คำกริยา', 'en', 'highlight')]
thwiktionary	misspelling_of	149133	interchangable	ภาษาอังกฤษ	1	1	[('คำคุณศัพท์', 'en', 'interchangeable')]
thwiktionary	misspelling_of	149134	changable	ภาษาอังกฤษ	1	1	[('คำคุณศัพท์', 'en', 'changeable')]
thwiktionary	misspelling_of	149135	millenium	ภาษาอังกฤษ	1	1	[('คำนาม', 'en', 'millennium')]
thwiktionary	misspelling_of	149136	millenia	ภาษาอังกฤษ	1	1	[('คำนาม', 'en', 'millennia')]
thwiktionary	misspelling_of	149137	millepede	ภาษาอังกฤษ	1	1	[('คำนาม', 'en', 'millipede')]
thwiktionary	misspelling_of	149138	millepedes	ภาษาอังกฤษ	1	1	[('คำนาม', 'en', 'millipedes')]
thwiktionary	misspelling_of	149139	protron	ภาษาอังกฤษ	1	1	[('คำนาม', 'en', 'proton')]
thwiktionary	misspelling_of	149140	refered	ภาษาอังกฤษ	1	1	[('คำกริยา', 'en', 'referred')]
thwiktionary	misspelling_of	149141	refering	ภาษาอังกฤษ	1	1	[('คำกริยา', 'en', 'referring')]
thwiktionary	misspelling_of	149142	seperately	ภาษาอังกฤษ	1	1	[('คำกริยาวิเศษณ์', 'en', 'separately')]
thwiktionary	misspelling_of	149143	tamborine	ภาษาอังกฤษ	1	1	[('คำนาม', 'en', 'tambourine')]
thwiktionary	misspelling_of	149144	yeild	ภาษาอังกฤษ	1	1	[('คำกริยา', 'en', 'yield')]
thwiktionary	misspelling_of	149145	risable	ภาษาอังกฤษ	1	1	[('คำคุณศัพท์', 'en', 'risible')]
thwiktionary	misspelling_of	149146	prefered	ภาษาอังกฤษ	1	1	[('คำกริยา', 'en', 'preferred')]
thwiktionary	misspelling_of	149147	prefering	ภาษาอังกฤษ	1	1	[('คำกริยา', 'en', 'preferring')]
thwiktionary	misspelling_of	149148	occured	ภาษาอังกฤษ	1	1	[('คำกริยา', 'en', 'occurred')]
thwiktionary	misspelling_of	149149	occuring	ภาษาอังกฤษ	1	1	[('คำกริยา', 'en', 'occurring')]
thwiktionary	misspelling_of	149150	occurence	ภาษาอังกฤษ	1	1	[('คำนาม', 'en', 'occurrence')]
thwiktionary	misspelling_of	149151	occurance	ภาษาอังกฤษ	1	1	[('คำนาม', 'en', 'occurrence')]
thwiktionary	misspelling_of	149152	occurrance	ภาษาอังกฤษ	1	1	[('คำนาม', 'en', 'occurrence')]
thwiktionary	misspelling_of	149153	noteable	ภาษาอังกฤษ	1	1	[('คำคุณศัพท์', 'en', 'notable')]
thwiktionary	misspelling_of	149154	masterbated	ภาษาอังกฤษ	1	1	[('คำกริยา', 'en', 'masturbated')]
thwiktionary	misspelling_of	149155	masterbates	ภาษาอังกฤษ	1	1	[('คำกริยา', 'en', 'masturbates')]
thwiktionary	misspelling_of	149156	masterbating	ภาษาอังกฤษ	1	1	[('คำกริยา', 'en', 'masturbating')]
thwiktionary	misspelling_of	149157	freind	ภาษาอังกฤษ	1	1	[('คำนาม', 'en', 'friend')]
thwiktionary	misspelling_of	149158	goverment	ภาษาอังกฤษ	1	1	[('คำนาม', 'en', 'government')]
thwiktionary	misspelling_of	149159	flourine	ภาษาอังกฤษ	1	1	[('คำนาม', 'en', 'fluorine')]
thwiktionary	misspelling_of	149160	doesnt	ภาษาอังกฤษ	1	1	"[('คำกริยา', 'en', ""doesn't"")]"
thwiktionary	misspelling_of	149161	dubloon	ภาษาอังกฤษ	1	1	[('คำนาม', 'en', 'doubloon')]
thwiktionary	misspelling_of	149162	exersize	ภาษาอังกฤษ	2	2	[('คำนาม', 'en', 'exercise'), ('คำกริยา', 'en', 'exercise')]
thwiktionary	misspelling_of	149163	existance	ภาษาอังกฤษ	1	1	[('คำนาม', 'en', 'existence')]
thwiktionary	misspelling_of	149164	exchangable	ภาษาอังกฤษ	1	1	[('คำคุณศัพท์', 'en', 'exchangeable')]
thwiktionary	misspelling_of	149165	asterix	ภาษาอังกฤษ	1	1	[('คำนาม', 'en', 'asterisk')]
thwiktionary	misspelling_of	149166	arithmatic	ภาษาอังกฤษ	1	1	[('คำนาม', 'en', 'arithmetic')]
thwiktionary	misspelling_of	149167	asprin	ภาษาอังกฤษ	1	1	[('คำนาม', 'en', 'aspirin')]
thwiktionary	misspelling_of	149168	bycicle	ภาษาอังกฤษ	1	1	[('คำนาม', 'en', 'bicycle')]
thwiktionary	misspelling_of	149169	accessable	ภาษาอังกฤษ	1	1	[('คำคุณศัพท์', 'en', 'accessible')]
thwiktionary	misspelling_of	149691	รัชการ	ภาษาไทย	1	1	[('คำนาม', 'th', 'รัชกาล')]
thwiktionary	misspelling_of	149692	ราชกาล	ภาษาไทย	2	2	[('คำนาม', 'th', 'รัชกาล'), ('คำนาม', 'th', 'ราชการ')]
thwiktionary	misspelling_of	149693	รัฐกาล	ภาษาไทย	1	1	[('คำนาม', 'th', 'รัชกาล')]
thwiktionary	misspelling_of	149884	ราชวงค์	ภาษาไทย	1	1	[('คำนาม', 'th', 'ราชวงศ์')]
thwiktionary	misspelling_of	149956	ตัวแปล	ภาษาไทย	1	1	[('คำนาม', 'th', 'ตัวแปร')]
thwiktionary	misspelling_of	152392	กระหรี่	ภาษาไทย	1	1	[('คำนาม', 'th', 'กะหรี่')]
thwiktionary	misspelling_of	153214	คำนวน	ภาษาไทย	1	1	[('คำกริยา', 'th', 'คำนวณ')]
thwiktionary	misspelling_of	153229	หวัดหวั่น	ภาษาไทย	1	1	[('คำกริยา', 'th', 'หวาดหวั่น')]
thwiktionary	misspelling_of	154107	จารบี	ภาษาไทย	1	1	[('คำนาม', 'th', 'จาระบี')]
thwiktionary	misspelling_of	155370	riseable	ภาษาอังกฤษ	1	1	[('คำคุณศัพท์', 'en', 'risible')]
thwiktionary	misspelling_of	156140	ขันเชนาะ	ภาษาไทย	1	1	[('คำกริยา', 'th', 'ขันชะเนาะ')]
thwiktionary	misspelling_of	165070	พรหมแดน	ภาษาไทย	1	1	[('คำนาม', 'th', 'พรมแดน')]
thwiktionary	misspelling_of	165662	ลำใย	ภาษาไทย	1	1	[('คำนาม', 'th', 'ลำไย')]
thwiktionary	misspelling_of	165663	คลื่นใส้	ภาษาไทย	1	1	[('คำกริยา', 'th', 'คลื่นไส้')]
thwiktionary	misspelling_of	166091	ใข่	ภาษาไทย	1	1	[('คำนาม', 'th', 'ไข่')]
thwiktionary	misspelling_of	166540	ฝรั่งเศษ	ภาษาไทย	1	1	[('คำวิสามานยนาม', 'th', 'ฝรั่งเศส')]
thwiktionary	misspelling_of	167009	ตระกร้า	ภาษาไทย	1	1	[('คำนาม', 'th', 'ตะกร้า')]
thwiktionary	misspelling_of	167016	ตระกร้อ	ภาษาไทย	1	1	[('คำนาม', 'th', 'ตะกร้อ')]
thwiktionary	misspelling_of	167137	อธิฐาน	ภาษาไทย	1	1	[('คำกริยา', 'th', 'อธิษฐาน')]
thwiktionary	misspelling_of	168479	ไกรลาศ	ภาษาไทย	1	1	[('คำวิสามานยนาม', 'th', 'ไกรลาส')]
thwiktionary	misspelling_of	169979	สถุน	ภาษาไทย	1	1	[('คำคุณศัพท์', 'th', 'สถุล')]
thwiktionary	misspelling_of	170441	ว๊าย	ภาษาไทย	1	1	[('คำอุทาน', 'th', 'ว้าย')]
thwiktionary	misspelling_of	170910	ละเอียดละออ	ภาษาไทย	1	1	[('คำคุณศัพท์', 'th', 'ละเอียดลออ')]
thwiktionary	misspelling_of	170911	ลเอียดลออ	ภาษาไทย	1	1	[('คำคุณศัพท์', 'th', 'ละเอียดลออ')]
thwiktionary	misspelling_of	174385	มงกุฏ	ภาษาไทย	1	1	[('คำนาม', 'th', 'มงกุฎ')]
thwiktionary	misspelling_of	174889	คลิ๊ก	ภาษาไทย	2	2	[('คำกริยา', 'th', 'คลิก'), ('คำอุทาน', 'th', 'คลิก')]
thwiktionary	misspelling_of	175329	มั๊ย	ภาษาไทย	1	1	[('คำอนุภาค', 'th', 'มั้ย')]
thwiktionary	misspelling_of	175426	romaani	ภาษาฟินแลนด์	2	1	[('คำนาม', 'fi', 'romani')]
thwiktionary	misspelling_of	221258	โครต	ภาษาไทย	3	3	[('คำนาม', 'th', 'โคตร'), ('คำคุณศัพท์', 'th', 'โคตร'), ('คำกริยาวิเศษณ์', 'th', 'โคตร')]
thwiktionary	misspelling_of	221568	ธุรี	ภาษาไทย	1	1	[('คำนาม', 'th', 'ธุลี')]
thwiktionary	misspelling_of	221575	คุ๊กกี้	ภาษาไทย	1	1	[('คำนาม', 'th', 'คุกกี้')]
thwiktionary	misspelling_of	221686	กระพริบ	ภาษาไทย	1	1	[('คำกริยา', 'th', 'กะพริบ')]
thwiktionary	misspelling_of	229392	เสปน	ภาษาไทย	1	1	[('คำวิสามานยนาม', 'th', 'สเปน')]
thwiktionary	misspelling_of	230495	สัมนา	ภาษาไทย	2	2	[('คำนาม', 'th', 'สัมมนา'), ('คำกริยา', 'th', 'สัมมนา')]
thwiktionary	misspelling_of	230496	เศรษฐีนี	ภาษาไทย	1	1	[('คำนาม', 'th', 'เศรษฐินี')]
thwiktionary	misspelling_of	230497	คฑา	ภาษาไทย	1	1	[('คำนาม', 'th', 'คทา')]
thwiktionary	misspelling_of	230498	ลักษณะนาม	ภาษาไทย	1	1	[('คำนาม', 'th', 'ลักษณนาม')]
thwiktionary	misspelling_of	230499	โมฆะบุรุษ	ภาษาไทย	1	1	[('คำนาม', 'th', 'โมฆบุรุษ')]
thwiktionary	misspelling_of	230500	ฤาษี	ภาษาไทย	1	1	[('คำนาม', 'th', 'ฤๅษี')]
thwiktionary	misspelling_of	230501	ฑูต	ภาษาไทย	2	1	[('คำนาม', 'th', 'ทูต')]
thwiktionary	misspelling_of	230502	ยมฑูต	ภาษาไทย	1	1	[('คำนาม', 'th', 'ยมทูต')]
thwiktionary	misspelling_of	230503	วีระกรรม	ภาษาไทย	1	1	[('คำนาม', 'th', 'วีรกรรม')]
thwiktionary	misspelling_of	230504	โล่ห์	ภาษาไทย	1	1	[('คำนาม', 'th', 'โล่')]
thwiktionary	misspelling_of	230505	อนุญาติ	ภาษาไทย	2	2	[('คำนาม', 'th', 'อนุญาต'), ('คำกริยา', 'th', 'อนุญาต')]
thwiktionary	misspelling_of	230506	องคชาติ	ภาษาไทย	1	1	[('คำนาม', 'th', 'องคชาต')]
thwiktionary	misspelling_of	230507	กาละเทศะ	ภาษาไทย	1	1	[('คำนาม', 'th', 'กาลเทศะ')]
thwiktionary	misspelling_of	230508	กงศุล	ภาษาไทย	1	1	[('คำนาม', 'th', 'กงสุล')]
thwiktionary	misspelling_of	230509	ภูติ	ภาษาไทย	2	1	[('คำนาม', 'th', 'ภูต')]
thwiktionary	misspelling_of	230510	ชนม์พรรษา	ภาษาไทย	1	1	[('คำนาม', 'th', 'ชนมพรรษา')]
thwiktionary	misspelling_of	232197	อาเจียร	ภาษาไทย	1	1	[('คำกริยา', 'th', 'อาเจียน')]
thwiktionary	misspelling_of	232480	ກະເບຶ້ອງ	ภาษาลาว	1	1	[('คำนาม', 'lo', 'ກະເບື້ອງ')]
thwiktionary	misspelling_of	233753	มาตราฐาน	ภาษาไทย	1	1	[('คำนาม', 'th', 'มาตรฐาน')]
thwiktionary	misspelling_of	233789	กระโหลก	ภาษาไทย	1	1	[('คำนาม', 'th', 'กะโหลก')]
thwiktionary	misspelling_of	233877	เพรช	ภาษาไทย	1	1	[('คำนาม', 'th', 'เพชร')]
thwiktionary	misspelling_of	234610	ซีอิ๋ว	ภาษาไทย	1	1	[('คำนาม', 'th', 'ซีอิ๊ว')]
thwiktionary	misspelling_of	234613	ซีอิ้ว	ภาษาไทย	1	1	[('คำนาม', 'th', 'ซีอิ๊ว')]
thwiktionary	misspelling_of	237618	อาจินต์	ภาษาไทย	1	1	[('คำกริยาวิเศษณ์', 'th', 'อาจิณ')]
thwiktionary	misspelling_of	239977	ชักกะเย่อ	ภาษาไทย	2	2	[('คำนาม', 'th', 'ชักเย่อ'), ('คำกริยา', 'th', 'ชักเย่อ')]
thwiktionary	misspelling_of	239978	ชักคะเย่อ	ภาษาไทย	2	2	[('คำนาม', 'th', 'ชักเย่อ'), ('คำกริยา', 'th', 'ชักเย่อ')]
thwiktionary	misspelling_of	240883	ปาฏิหารย์	ภาษาไทย	1	1	[('คำนาม', 'th', 'ปาฏิหาริย์')]
thwiktionary	misspelling_of	240885	ปิคนิค	ภาษาไทย	2	2	[('คำนาม', 'th', 'ปิกนิก'), ('คำคุณศัพท์', 'th', 'ปิกนิก')]
thwiktionary	misspelling_of	240888	กระทัดรัด	ภาษาไทย	1	1	[('คำคุณศัพท์', 'th', 'กะทัดรัด')]
thwiktionary	misspelling_of	244312	descendent	ภาษาอังกฤษ	3	1	[('คำนาม', 'en', 'descendant')]
thwiktionary	misspelling_of	258523	ปรามาศ	ภาษาไทย	2	2	[('คำกริยา', 'th', 'ปรามาส'), ('คำนาม', 'th', 'ปรามาส')]
thwiktionary	misspelling_of	258893	อนุเสาวรีย์	ภาษาไทย	1	1	[('คำนาม', 'th', 'อนุสาวรีย์')]
thwiktionary	misspelling_of	262586	รังเกลียด	ภาษาไทย	1	1	[('คำกริยา', 'th', 'รังเกียจ')]
thwiktionary	misspelling_of	264540	โบราญ	ภาษาไทย	2	1	[('คำคุณศัพท์', 'th', 'โบราณ')]
thwiktionary	misspelling_of	264728	สังฆโลก	ภาษาไทย	1	1	[('คำนาม', 'th', 'สังคโลก')]
thwiktionary	misspelling_of	265338	สันดาล	ภาษาไทย	1	1	[('คำนาม', 'th', 'สันดาน')]
thwiktionary	misspelling_of	265339	สันดร	ภาษาไทย	1	1	[('คำนาม', 'th', 'สันดอน')]
thwiktionary	misspelling_of	265725	กาละมัง	ภาษาไทย	1	1	[('คำนาม', 'th', 'กะละมัง')]
thwiktionary	misspelling_of	265727	กาละแม	ภาษาไทย	1	1	[('คำนาม', 'th', 'กะละแม')]
thwiktionary	misspelling_of	266484	นิษิต	ภาษาไทย	1	1	[('คำนาม', 'th', 'นิสิต')]
thwiktionary	misspelling_of	266485	นิษัย	ภาษาไทย	1	1	[('คำนาม', 'th', 'นิสัย')]
thwiktionary	misspelling_of	266908	សាស្ត្រចារ្យ	ภาษาเขมร	1	1	[('คำนาม', 'km', 'សាស្ត្រាចារ្យ')]
thwiktionary	misspelling_of	267109	น้ำแข็งใส	ภาษาไทย	1	1	[('คำนาม', 'th', 'น้ำแข็งไส')]
thwiktionary	misspelling_of	270051	ຄວ່ຳບາດ	ภาษาลาว	1	1	[('คำกริยา', 'lo', 'ຂວ້ຳບາດ')]
thwiktionary	misspelling_of	270104	สเต็ก	ภาษาไทย	1	1	[('คำนาม', 'th', 'สเต๊ก')]
thwiktionary	misspelling_of	270690	ทศกรรณ	ภาษาไทย	1	1	[('คำวิสามานยนาม', 'th', 'ทศกัณฐ์')]
thwiktionary	misspelling_of	270691	ทศกัณฑ์	ภาษาไทย	1	1	[('คำวิสามานยนาม', 'th', 'ทศกัณฐ์')]
thwiktionary	misspelling_of	270700	ทศกรรณฐ์	ภาษาไทย	1	1	[('คำวิสามานยนาม', 'th', 'ทศกัณฐ์')]
thwiktionary	misspelling_of	270701	ทศกรรฐ์	ภาษาไทย	1	1	[('คำวิสามานยนาม', 'th', 'ทศกัณฐ์')]
thwiktionary	misspelling_of	281409	ใหม้	ภาษาไทย	1	1	[('คำกริยา', 'th', 'ไหม้')]
thwiktionary	misspelling_of	284918	เลสเบี้ยน	ภาษาไทย	1	1	[('คำนาม', 'th', 'เลสเบียน')]
thwiktionary	misspelling_of	286072	แอปเปิ้ล	ภาษาไทย	1	1	[('คำนาม', 'th', 'แอปเปิล')]
thwiktionary	misspelling_of	287728	ราศรี	ภาษาไทย	1	1	[('คำนาม', 'th', 'ราศี')]
thwiktionary	misspelling_of	289611	เกษร	ภาษาไทย	2	1	[('คำนาม', 'th', 'เกสร')]
thwiktionary	misspelling_of	290793	เคหะสถาน	ภาษาไทย	1	1	[('คำนาม', 'th', 'เคหสถาน')]
thwiktionary	misspelling_of	295111	กระตือรือล้น	ภาษาไทย	1	1	[('คำคุณศัพท์', 'th', 'กระตือรือร้น')]
thwiktionary	misspelling_of	295114	กระทันหัน	ภาษาไทย	1	1	[('คำคุณศัพท์', 'th', 'กะทันหัน')]
thwiktionary	misspelling_of	295325	โคโลญจ์	ภาษาไทย	2	2	[('คำวิสามานยนาม', 'th', 'โคโลญ'), ('คำนาม', 'th', 'โคโลญ')]
thwiktionary	misspelling_of	295326	โคโลญจน์	ภาษาไทย	2	2	[('คำวิสามานยนาม', 'th', 'โคโลญ'), ('คำนาม', 'th', 'โคโลญ')]
thwiktionary	misspelling_of	295514	ขโยง	ภาษาไทย	2	2	[('คำนาม', 'th', 'โขยง'), ('คำคุณศัพท์', 'th', 'โขยง')]
thwiktionary	misspelling_of	296547	หงษ์	ภาษาไทย	2	1	[('คำนาม', 'th', 'หงส์')]
thwiktionary	misspelling_of	299426	ขันชเนาะ	ภาษาไทย	1	1	[('คำกริยา', 'th', 'ขันชะเนาะ')]
thwiktionary	misspelling_of	299449	เคลียด	ภาษาไทย	1	1	[('คำคุณศัพท์', 'th', 'เครียด')]
thwiktionary	misspelling_of	299450	โคโลญ์	ภาษาไทย	2	2	[('คำวิสามานยนาม', 'th', 'โคโลญ'), ('คำนาม', 'th', 'โคโลญ')]
thwiktionary	misspelling_of	299453	ฑูตานุฑูต	ภาษาไทย	1	1	[('คำนาม', 'th', 'ทูตานุทูต')]
thwiktionary	misspelling_of	299454	ทูตานุฑูต	ภาษาไทย	1	1	[('คำนาม', 'th', 'ทูตานุทูต')]
thwiktionary	misspelling_of	299457	วีระชน	ภาษาไทย	1	1	[('คำนาม', 'th', 'วีรชน')]
thwiktionary	misspelling_of	299458	วีระบุรุษ	ภาษาไทย	1	1	[('คำนาม', 'th', 'วีรบุรุษ')]
thwiktionary	misspelling_of	299459	ประจาญ	ภาษาไทย	1	1	[('คำกริยา', 'th', 'ประจาน')]
thwiktionary	misspelling_of	299460	ตระเวณ	ภาษาไทย	1	1	[('คำกริยา', 'th', 'ตระเวน')]
thwiktionary	misspelling_of	299463	ลาดตระเวณ	ภาษาไทย	1	1	[('คำกริยา', 'th', 'ลาดตระเวน')]
thwiktionary	misspelling_of	299464	สำมนา	ภาษาไทย	2	2	[('คำนาม', 'th', 'สัมมนา'), ('คำกริยา', 'th', 'สัมมนา')]
thwiktionary	misspelling_of	299465	สำมะนา	ภาษาไทย	2	2	[('คำนาม', 'th', 'สัมมนา'), ('คำกริยา', 'th', 'สัมมนา')]
thwiktionary	misspelling_of	299468	ปราถนา	ภาษาไทย	1	1	[('คำกริยา', 'th', 'ปรารถนา')]
thwiktionary	misspelling_of	299469	รำคาน	ภาษาไทย	1	1	[('คำกริยา', 'th', 'รำคาญ')]
thwiktionary	misspelling_of	299471	อวศานติ์	ภาษาไทย	1	1	[('คำกริยา', 'th', 'อวสาน')]
thwiktionary	misspelling_of	299472	อวสาณ	ภาษาไทย	1	1	[('คำกริยา', 'th', 'อวสาน')]
thwiktionary	misspelling_of	299473	อวสานต์	ภาษาไทย	1	1	[('คำกริยา', 'th', 'อวสาน')]
thwiktionary	misspelling_of	299474	อาจิน	ภาษาไทย	1	1	[('คำกริยาวิเศษณ์', 'th', 'อาจิณ')]
thwiktionary	misspelling_of	299475	ทะแยง	ภาษาไทย	1	1	[('คำคุณศัพท์', 'th', 'ทแยง')]
thwiktionary	misspelling_of	299476	แทยง	ภาษาไทย	1	1	[('คำคุณศัพท์', 'th', 'ทแยง')]
thwiktionary	misspelling_of	299477	โขมย	ภาษาไทย	1	1	[('คำกริยา', 'th', 'ขโมย')]
thwiktionary	misspelling_of	299562	อาณุภาพ	ภาษาไทย	1	1	[('คำนาม', 'th', 'อานุภาพ')]
thwiktionary	misspelling_of	299679	อินเตอร์เน็ต	ภาษาไทย	1	1	[('คำวิสามานยนาม', 'th', 'อินเทอร์เน็ต')]
thwiktionary	misspelling_of	299686	มาตราการ	ภาษาไทย	1	1	[('คำนาม', 'th', 'มาตรการ')]
thwiktionary	misspelling_of	307004	ศาสตราวุธ	ภาษาไทย	1	1	[('คำนาม', 'th', 'ศัสตราวุธ')]
thwiktionary	misspelling_of	307170	ฆรุฑ	ภาษาไทย	1	1	[('คำนาม', 'th', 'ครุฑ')]
thwiktionary	misspelling_of	307845	ก.ท.ม.	ภาษาไทย	1	1	[('คำนาม', 'th', 'กทม.')]
thwiktionary	misspelling_of	309956	ผาสุข	ภาษาไทย	2	2	[('คำนาม', 'th', 'ผาสุก'), ('คำคุณศัพท์', 'th', 'ผาสุก')]
thwiktionary	misspelling_of	311225	ธิเบต	ภาษาไทย	1	1	[('คำวิสามานยนาม', 'th', 'ทิเบต')]
