dbname	template	page_id	page_title	l2_heading	num_definitions	num_templates	templates
cawiktionary	forma-inc	288509	garantitzar	{{-ca-}}	1	1	[('verb', 'ca', 'garantir')]
cawiktionary	forma-inc	531396	idag	{{-da-}}	1	1	[('adverbi', 'da', 'i dag')]
cawiktionary	forma-inc	531396	idag	{{-no-}}	1	1	[('adverbi', 'no', 'i dag')]
cawiktionary	forma-inc	555679	improvitzar	{{-ca-}}	1	1	[('verb', 'ca', 'improvisar')]
cawiktionary	forma-inc	567900	sempre i quant	{{-ca-}}	1	1	[('conjunció', 'ca', 'sempre i quan')]
cawiktionary	forma-inc	569084	raptament	{{-ca-}}	1	1	[('nom', 'ca', 'reptament')]
cawiktionary	forma-inc	584360	Çekoslavakya	{{-tr-}}	1	1	[('nom propi', 'tr', 'Çekoslovakya')]
