page_id	page_title	section_heading	misspelling	suggested_word	formatting	word_length	detected_language_confidence	text_sent_to_model	detected_language	surrounding_text
4318	A-		allfart	['alsfatt']	['is_table']	7				auch to alternate  abwexele   Phrases with 'abwexele'   (sich) abwechseln always allfart  Phrases with 'allfart'     immer anabaptists die Widderdaafer die Wiedertäufer, Täufer  (plural form) 
9475	Heinrich Schütz	feil:schutz.jpg	allfart	['alsfatt']	['is_text']	7				"miniatur|rechts|Heinrich Schütz, Pikder vun Christoph Spätner, um 1660 
 Heinrich Schütz , in autografen Handschriften allfart  Henrich ,  (*"
