page_id	page_title	section_heading	misspelling	suggested_word	formatting	word_length	detected_language_confidence	text_sent_to_model	detected_language	surrounding_text
5006	𐌾𐌿𐌻𐌴𐌹𐍃 𐌺𐌰𐌹𐍃𐌰𐍂	𐍅𐌹𐌲𐌰𐌽 𐌹𐌽 𐌲𐌰𐌻𐌻𐌾𐌰	𐌼𐌹𐌸𐌸𐌰𐌽𐌴	['𐌼𐌹𐌸𐌸𐌰𐌽𐌴𐌹']	['is_text']	7				"thumbnail|left|𐍅𐌰𐌹𐍂𐌺𐌹𐌲𐌲𐌴𐍄𐌰𐌿𐍂𐌴𐌹𐌺𐍃 𐌰𐍄-𐍅𐌰𐌹𐍂𐍀𐌹𐌸 𐌹𐍃 𐍅𐌴𐍀𐌽𐌰 𐌰𐍄 𐍆𐍉𐍄𐌿𐌼 𐌾𐌿𐌻𐌴𐌹𐍃 𐌺𐌰𐌹𐍃𐌰𐍂𐌹𐍃 

𐌿𐌽𐌳 𐌸𐌰𐍄𐌴 𐌺𐌰𐌹𐍃𐌰𐍂 𐍅𐌰𐍃 𐌹𐌽 𐌱𐍂𐌹𐍄𐌰-𐌻𐌰𐌽𐌳, 𐌾𐌿𐌻𐌾𐌰, 𐌵𐌴𐌽𐌰𐌹𐍃 𐍀𐍉𐌼𐍀𐌴𐌹𐍃, 𐌳𐌰𐌿 𐌹𐌽 𐌱𐌰𐍂𐌽-𐌱𐌰𐌿𐍂𐌸𐍃 𐌹𐌽 𐌽𐌳ʹ. 𐌺𐍂𐌰𐍃𐍃𐌿𐍃 𐍅𐌰𐍃 𐌰𐍆-𐍃𐌻𐌰𐌷 𐌹𐌽 𐌱𐌰𐌳𐍅𐌹𐍃 𐌺𐌰𐍂𐍂𐌰𐌹 𐌹𐌽 𐌽𐌲ʹ, 𐌾𐌰𐌷 𐍀𐍉𐌼𐍀𐌴𐌹𐍃 𐌿𐌽-𐍅𐌴𐍂𐌹𐌳𐌰 𐌻𐌹𐌿𐌲𐌰𐌽 𐌼𐌹𐌺𐌹𐌻𐌰-𐌽𐌹𐍆𐍄𐍃 𐌺𐌰𐌹𐍃𐌰𐍂𐌹𐍃. 𐍀𐍉𐌼𐍀𐌴𐌹𐍃 𐌰𐌹𐍂𐌶𐌴𐌹𐍃 𐌲𐌰-𐌻𐌰𐌿𐌱𐌴𐌹𐌽𐍃 𐌹𐌽 𐌺𐌰𐌹𐍃𐌰𐍂,    𐌳𐌹𐍃-𐍅𐌰𐍃. 𐌹𐌽 𐌽𐌱ʹ,    (𐍅𐌰𐌹𐍂𐌺𐌹𐌲𐌲𐌴𐍄𐌰𐌿𐍂𐌴𐌹𐌺𐍃) 𐍄𐌹𐌿𐌷𐌰𐌽𐍃 𐌼𐌹𐌺𐌹𐌻𐌹𐌶𐌰 𐌿𐍃-𐍅𐌰𐌻𐍄𐌴𐌹𐌽𐍃 𐌹𐌽 𐌲𐌰𐌻𐌻𐌾𐌰, 𐌲𐌰-𐍅𐌹𐌳𐌰𐌽𐍃 𐌲𐌰𐌻𐌻𐌹𐍃𐌺𐍃 𐌺𐌿𐌽𐌾𐌰 𐌾𐌰𐌷 𐌱𐌻𐌰𐌿𐌸𐌾𐌰𐌽𐌳𐍃 𐌺𐌰𐌹𐍃𐌰𐍂 𐌼𐌰𐌽𐌰𐌲𐍃 𐌼𐌴𐌻𐌰 𐌿𐍆𐌰𐍂. 𐌰𐌸𐌸𐌰𐌽 𐌺𐌰𐌹𐍃𐌰𐍂 𐌱𐌹 𐍃𐍀𐌴𐌳𐌹𐍃𐍄𐌹𐌽 𐌲𐌰-𐌾𐌹𐌿𐌺𐌹𐌸𐍃 𐌹𐌽 𐌱𐌰𐌳𐍅𐌹𐍃 𐌰𐌻𐌴𐍃𐌹𐌰. 𐌲𐌰𐌻𐌻𐌾𐌰 𐍅𐌰𐍃 𐌽𐌿 𐌿𐌽𐌳𐌰𐍂 𐍂𐌿𐌼𐍉𐌽𐍃 𐍅𐌰𐌻𐌳𐌿𐍆𐌽𐌹. 𐌱𐌹 𐍀𐌻𐌿𐍄𐌰𐍂𐌺𐌿𐍃, 𐌹𐌽-𐍃𐌰𐌷𐍄𐌹𐌸 𐌷𐌰𐍂𐌾𐌹𐍃 𐍅𐌴𐌹𐌷𐌰𐌽𐍃 𐍃𐍅𐌰 𐌼𐌰𐌽𐌰𐌲𐍃 𐍃𐍅𐌴 𐌸𐍂𐌹𐌳𐌾𐌰 𐌼𐌹𐌻𐌾𐍉 𐌼𐌰𐌽𐌽𐌰𐌽𐍃 𐌼𐌹𐌸𐌸𐌰𐌽𐌴 𐍅𐌹𐌲𐌰𐌽, 𐌰𐌹𐌽𐌰 𐌼𐌹𐌻𐌾𐍉 𐌳𐌹𐍅𐌰𐌽𐍃, 𐌰𐌻𐌾𐌹𐍃 𐌼𐌹𐌻𐌾𐍉 𐍅𐌰𐍃 𐌲𐌰-𐌸𐌹𐍅𐌰𐌽𐍃. 𐍂𐌿𐌼𐍉𐌽𐌴𐌹𐍃 𐌿𐍆-𐌷𐌽𐌰𐌹𐍅𐌾𐌰𐌽𐌳𐍃 𐍄ʹ 𐌺𐌿𐌽𐌾𐌰 𐌾𐌰𐌷 𐍆𐍂𐌰-𐌵𐌹𐍃𐍄𐌾𐌰𐌽𐌳𐍃 𐍉ʹ 𐌱𐌰𐌿𐍂𐌲𐌾𐌰𐌽𐍃. 𐍃𐌰𐌷 𐍂𐌰𐌸𐌾𐍉 𐌽𐌹-𐍅𐌴𐍃𐌹 𐌲𐌻𐌰𐌲𐌲𐍅𐌿𐍃. 𐌰𐍆𐌰𐍂 𐍅𐌹𐌲𐌰𐌽, 𐌲𐌰-𐌼𐌴𐌻𐌳𐌹𐌰    (𐍂𐌰𐌸𐌾𐍉𐌽𐍃 𐌰𐌽𐌰 𐌲𐌰𐌻𐌻𐌹𐍃𐌺𐍃 𐍅𐌹𐌲𐌰𐌽).

"
