page_id	page_title	section_heading	misspelling	suggested_word	formatting	word_length	detected_language_confidence	text_sent_to_model	detected_language	surrounding_text
23997	Wikipedia n'asturianu	evolución	Uiquipedia	['Wikipedia']	['is_table', 'is_first_cap']	10				Octave Mirbeau 10 000 20 de payares de 2007 Ḥoquei 11 000 11 de marzu de 2008La Uiquipedia supera los 11 000 artículos y entama “La Quincena a Sestaferia” pa meyorar los conteníos Asturnews, Consultáu'l 31 d'avientu de 2013  Años 690 edC 12 000 10 de febreru de 2009 Cuvette-Ouest
23997	Wikipedia n'asturianu	evolución	Uiquipedia	['Wikipedia']	['is_table', 'is_first_cap']	10				Santa Victoria 18 000 13 de mayu de 2012 Eremalche 19 000 4 d'ochobre de 2013Creado en el marco de la Viquimarató nit digital. La Uiquipedia perpasa los 19 000 artículos Queyeho.com Consultáu'l 31 d'avientu de 2013  Historia de la llingua catalana 20 000 5 de xineru de 2015 Fermín Canella Secades
