wiki,language,num_extracted_misspelling,num_detected_misspelling,num_unique_misspelling,gini_coefficient,filtered_num_detected_misspelling,filtered_num_unique_misspelling,filtered_gini_coefficient
ptwiki,pt,70,1039,29.0,0.8526766429355114,574.0,22.0,0.7820715839521487
frwiki,fr,78,625,43.0,0.7697116226113608,216.0,36.0,0.612911512418553
shwiki,sh,10,61,7.0,0.4355971846968941,45.0,5.0,0.35555555160493835
plwiki,pl,7,5,3.0,0.13333332533333378,0.0,,
ckbwiki,ckb,1,1,1.0,0.0,1.0,1.0,0.0
piwiki,pi,4,0,,,,,
guwiki,gu,9,3140,5.0,0.778343948920646,2505.0,5.0,0.7809980038361282
nnwiki,nn,10,16,3.0,0.4999999906250001,10.0,1.0,0.0
hywiki,hy,6,0,,,,,
mywiki,my,12,77,9.0,0.7186147102153259,24.0,9.0,0.4814814634259265
azwiki,az,12,269,9.0,0.6063610058192797,235.0,9.0,0.5966903050434084
nowiki,no,8,8,4.0,0.31249998437500076,7.0,4.0,0.24999998571428655
ruwiki,ru,16,221,8.0,0.8082579156262157,48.0,5.0,0.5583333275173612
cywiki,cy,6,3,2.0,0.16666665555555626,2.0,1.0,0.0
mswiki,ms,7,2311,5.0,0.6608394632927651,1452.0,5.0,0.6523415975715077
kmwiki,km,8,208,6.0,0.7435897414447732,49.0,6.0,0.5884353669443289
tawiki,ta,1,0,,,,,
eowiki,eo,9,738,6.0,0.6833784998960789,601.0,6.0,0.6896838595444088
lldwiki,lld,1,0,,,,,
thwiki,th,242,2477,134.0,0.7365463719275764,758.0,101.0,0.6199221422662221
lawiki,la,6,21,2.0,0.26190475941043084,5.0,2.0,0.29999998800000044
mrwiki,mr,1,37,1.0,0.0,29.0,1.0,0.0
urwiki,ur,4,40,3.0,0.549999995875,35.0,2.0,0.4142857119183673
knwiki,kn,1,678,1.0,0.0,550.0,1.0,0.0
kawiki,ka,20,407,14.0,0.6926991903164437,223.0,13.0,0.6195239701724888
lvwiki,lv,14,116,6.0,0.6839080424395562,49.0,5.0,0.5469387699291962
idwiki,id,13,25724,6.0,0.8109029181379306,23001.0,6.0,0.8147979073161075
bnwiki,bn,4,2152,3.0,0.6452912018926948,1654.0,3.0,0.6477226923452337
rowiki,ro,2,33,1.0,0.0,26.0,1.0,0.0
iswiki,is,12,21,8.0,0.422619031519275,14.0,6.0,0.4523809329931981
xalwiki,xal,1,0,,,,,
hewiki,he,2,88,1.0,0.0,55.0,1.0,0.0
cawiki,ca,3,154,2.0,0.493506492865576,131.0,1.0,0.0
swwiki,sw,2,5,1.0,0.0,5.0,1.0,0.0
pswiki,ps,1,5,1.0,0.0,5.0,1.0,0.0
zhwiki,zh,2,0,,,,,
gdwiki,gd,1,0,,,,,
yiwiki,yi,1,0,,,,,
viwiki,vi,18,2078,8.0,0.8024542826554555,1661.0,7.0,0.7919497717484688
cswiki,cs,4,1,1.0,0.0,1.0,1.0,0.0
scwiki,sc,1,78,1.0,0.0,75.0,1.0,0.0
afwiki,af,2,65,1.0,0.0,58.0,1.0,0.0
lbwiki,lb,1,0,,,,,
nvwiki,nv,6,8,2.0,0.3749999906250002,5.0,1.0,0.0
hiwiki,hi,24,36546,20.0,0.8624254363890753,30879.0,20.0,0.8696282262463403
elwiki,el,43,859,13.0,0.8818841215273716,663.0,11.0,0.8726175770521496
scowiki,sco,1,1,1.0,0.0,0.0,,
gotwiki,got,30,1,1.0,0.0,1.0,1.0,0.0
miwiki,mi,1,0,,,,,
enwiki,en,5420,29202,1331.0,0.9052543677248999,10909.0,1074.0,0.8291126971992476
mlwiki,ml,20,838,11.0,0.6919071372996229,624.0,11.0,0.672494171308686
sawiki,sa,4,0,,,,,
mtwiki,mt,6,12,2.0,0.4166666597222224,10.0,2.0,0.39999999200000014
svwiki,sv,90,256,16.0,0.749511714065552,64.0,15.0,0.6520833180501306
jawiki,ja,19,40,4.0,0.3749999962500001,7.0,3.0,0.28571427346938827
cuwiki,cu,8,0,,,,,
fiwiki,fi,97,2156,45.0,0.8991341972575274,995.0,36.0,0.8522333860846051
simplewiki,en,5420,896,231.0,0.6603760652257619,492.0,150.0,0.6041463230443195
jvwiki,jv,4,72,2.0,0.3333333324074074,69.0,2.0,0.34057970915773994
kswiki,ks,1,1,1.0,0.0,1.0,1.0,0.0
cebwiki,ceb,4,72,3.0,0.6203703677854939,68.0,3.0,0.6274509776239908
trwiki,tr,58,4780,33.0,0.8406238107547616,2967.0,29.0,0.829306276283432
dewiki,de,40,1775,10.0,0.8574084502211784,408.0,5.0,0.5960784306420608
ocwiki,oc,5,12,2.0,0.3333333277777779,4.0,2.0,0.0
crhwiki,crh,2,1,1.0,0.0,0.0,,
tlwiki,tl,6,1,1.0,0.0,0.0,,
pawiki,pa,5,185,2.0,0.29459459427611395,149.0,2.0,0.291946308332958
tewiki,te,2,67,2.0,0.4552238792381377,49.0,2.0,0.45918367159516865
mkwiki,mk,236,1896,117.0,0.7941595392588761,1540.0,106.0,0.7911051158485316
gawiki,ga,1,1,1.0,0.0,1.0,1.0,0.0
itwiki,it,202,622753,79.0,0.9861688667021657,39564.0,61.0,0.9732767492047927
pdcwiki,pdc,1,2,1.0,0.0,1.0,1.0,0.0
scnwiki,scn,3,3,1.0,0.0,2.0,1.0,0.0
bclwiki,bcl,40,7874,27.0,0.7924909921176465,7172.0,26.0,0.7918078850791207
arywiki,ary,1,1,1.0,0.0,0.0,,
astwiki,ast,1,2,1.0,0.0,0.0,,
dawiki,da,27,182,14.0,0.6507064314152881,108.0,10.0,0.6277777719650206
arwiki,ar,20,2468,15.0,0.8349000535174161,1768.0,13.0,0.8544204657831662
huwiki,hu,70,2110,42.0,0.7247573896654569,1330.0,36.0,0.7167502069153961
hawwiki,haw,1,47,1.0,0.0,45.0,1.0,0.0
nlwiki,nl,46,3197,19.0,0.7568279468033932,1135.0,19.0,0.7210758160894581
kowiki,ko,14,200,8.0,0.55499999778,85.0,8.0,0.6338235234463667
mnwiki,mn,1,1,1.0,0.0,0.0,,
fowiki,fo,7,11,3.0,0.3636363537190085,2.0,2.0,0.0
eswiki,es,186,7847,119.0,0.8581002414719796,4372.0,101.0,0.8551085646909309
