dbname	template	page_id	page_title	l2_heading	num_definitions	num_templates	templates
mswiktionary	misspelling_of	11174	iyun	{{seksyen|crh}}	1	1	[('kata nama کات نام', 'crh', 'iyün')]
mswiktionary	kesalahan_ejaan	11174	iyun	{{seksyen|crh}}	1	1	[('kata nama کات نام', 'crh', 'iyün')]
