project_group	10-29	30-149	150-599	600-1199	1200+
arwiki	14	59	53	37	108
asia_wps	11	79	80	54	159
cee_wps	113	549	614	337	979
commons	93	441	628	375	1754
dewiki	81	584	727	350	848
enwiki	545	3032	3096	1168	2889
eswiki	70	363	375	128	380
frwiki	90	536	588	257	620
itwiki	33	224	280	116	304
jawiki	57	466	451	152	193
kowiki	1	29	40	12	51
malay_wps	19	88	98	50	112
meaf_wps	89	356	405	207	580
metawiki	2	15	39	23	58
nlwiki	16	118	104	70	176
other	16	132	210	118	454
ptwiki	46	172	162	65	144
ruwiki	51	282	368	168	403
sasia_wps	24	70	80	59	183
viwiki	7	42	47	17	54
weur_wps	32	262	330	141	556
wikidata	14	99	144	77	290
zhwiki	37	239	287	122	311
