module gitlab.wikimedia.org/repos/releng/jwt-authorizer

go 1.18

require (
	github.com/lestrrat-go/jwx v1.2.24
	github.com/pborman/getopt/v2 v2.1.0
)

require (
	github.com/decred/dcrd/dcrec/secp256k1/v4 v4.0.0-20210816181553-5444fa50b93d // indirect
	github.com/goccy/go-json v0.9.7 // indirect
	github.com/lestrrat-go/backoff/v2 v2.0.8 // indirect
	github.com/lestrrat-go/blackmagic v1.0.0 // indirect
	github.com/lestrrat-go/httpcc v1.0.1 // indirect
	github.com/lestrrat-go/iter v1.0.1 // indirect
	github.com/lestrrat-go/option v1.0.0 // indirect
	github.com/pkg/errors v0.9.1 // indirect
	golang.org/x/crypto v0.0.0-20220427172511-eb4f295cb31f // indirect
)
