module gitlab.wikimedia.org/repos/releng/imagefs

go 1.21.4

require (
	github.com/containers/image/v5 v5.31.0
	github.com/opencontainers/image-spec v1.1.0
	github.com/pkg/errors v0.9.1
	github.com/stretchr/testify v1.9.0
)

require (
	github.com/containers/libtrust v0.0.0-20230121012942-c1716e8a8d01 // indirect
	github.com/containers/ocicrypt v1.1.10 // indirect
	github.com/containers/storage v1.54.0 // indirect
	github.com/davecgh/go-spew v1.1.2-0.20180830191138-d8f796af33cc // indirect
	github.com/docker/docker v26.1.3+incompatible // indirect
	github.com/docker/go-connections v0.5.0 // indirect
	github.com/docker/go-units v0.5.0 // indirect
	github.com/json-iterator/go v1.1.12 // indirect
	github.com/klauspost/compress v1.17.8 // indirect
	github.com/klauspost/pgzip v1.2.6 // indirect
	github.com/moby/sys/mountinfo v0.7.1 // indirect
	github.com/moby/sys/user v0.1.0 // indirect
	github.com/modern-go/concurrent v0.0.0-20180306012644-bacd9c7ef1dd // indirect
	github.com/modern-go/reflect2 v1.0.2 // indirect
	github.com/opencontainers/go-digest v1.0.0 // indirect
	github.com/opencontainers/runtime-spec v1.2.0 // indirect
	github.com/pmezard/go-difflib v1.0.1-0.20181226105442-5d4384ee4fb2 // indirect
	github.com/sirupsen/logrus v1.9.3 // indirect
	github.com/syndtr/gocapability v0.0.0-20200815063812-42c35b437635 // indirect
	github.com/ulikunitz/xz v0.5.12 // indirect
	github.com/vbatts/tar-split v0.11.5 // indirect
	golang.org/x/exp v0.0.0-20240506185415-9bf2ced13842 // indirect
	golang.org/x/sys v0.20.0 // indirect
	gopkg.in/yaml.v3 v3.0.1 // indirect
)
