module gitlab.wikimedia.org/repos/releng/blubber

require (
	github.com/atsushinee/go-markdown-generator v0.0.0-20231027094725-92d26ffbe778
	github.com/containerd/containerd v1.7.23
	github.com/containers/image/v5 v5.25.0
	github.com/cucumber/godog v0.14.1
	github.com/distribution/distribution v2.8.1+incompatible
	github.com/docker/distribution v2.8.2+incompatible
	github.com/ghodss/yaml v1.0.0
	github.com/git-chglog/git-chglog v0.15.1
	github.com/google/shlex v0.0.0-20191202100458-e7afc7fbc510
	github.com/moby/buildkit v0.20.0
	github.com/moby/docker-image-spec v1.3.1
	github.com/opencontainers/go-digest v1.0.0
	github.com/opencontainers/image-spec v1.1.0
	github.com/pborman/getopt v1.1.0
	github.com/pborman/getopt/v2 v2.1.0
	github.com/pkg/errors v0.9.1
	github.com/santhosh-tekuri/jsonschema/v5 v5.3.1
	github.com/stretchr/testify v1.10.0
	github.com/utahta/go-openuri v0.1.0
	github.com/wk8/go-ordered-map v0.1.0
	gitlab.wikimedia.org/repos/releng/llbtest v0.0.1
	golang.org/x/lint v0.0.0-20200302205851-738671d3881b
	golang.org/x/sync v0.10.0
	gopkg.in/go-playground/validator.v9 v9.31.0
)

require (
	github.com/AdaLogics/go-fuzz-headers v0.0.0-20240806141605-e8a1dd7889d6 // indirect
	github.com/AlecAivazis/survey/v2 v2.3.2 // indirect
	github.com/Masterminds/goutils v1.1.1 // indirect
	github.com/Masterminds/semver/v3 v3.1.1 // indirect
	github.com/Masterminds/sprig/v3 v3.2.2 // indirect
	github.com/Microsoft/go-winio v0.6.2 // indirect
	github.com/Microsoft/hcsshim v0.12.9 // indirect
	github.com/andygrunwald/go-jira v1.14.0 // indirect
	github.com/containerd/cgroups/v3 v3.0.5 // indirect
	github.com/containerd/containerd/api v1.8.0 // indirect
	github.com/containerd/containerd/v2 v2.0.2 // indirect
	github.com/containerd/continuity v0.4.5 // indirect
	github.com/containerd/errdefs v1.0.0 // indirect
	github.com/containerd/errdefs/pkg v0.3.0 // indirect
	github.com/containerd/fifo v1.1.0 // indirect
	github.com/containerd/log v0.1.0 // indirect
	github.com/containerd/nydus-snapshotter v0.15.0 // indirect
	github.com/containerd/platforms v1.0.0-rc.1 // indirect
	github.com/containerd/stargz-snapshotter/estargz v0.16.3 // indirect
	github.com/containerd/ttrpc v1.2.7 // indirect
	github.com/containerd/typeurl/v2 v2.2.3 // indirect
	github.com/containers/libtrust v0.0.0-20230121012942-c1716e8a8d01 // indirect
	github.com/containers/ocicrypt v1.2.0 // indirect
	github.com/containers/storage v1.46.0 // indirect
	github.com/coreos/go-semver v0.3.0 // indirect
	github.com/cpuguy83/go-md2man/v2 v2.0.5 // indirect
	github.com/cucumber/gherkin/go/v26 v26.2.0 // indirect
	github.com/cucumber/messages/go/v21 v21.0.1 // indirect
	github.com/davecgh/go-spew v1.1.2-0.20180830191138-d8f796af33cc // indirect
	github.com/distribution/reference v0.6.0 // indirect
	github.com/docker/docker v27.5.1+incompatible // indirect
	github.com/docker/go-connections v0.5.0 // indirect
	github.com/docker/go-units v0.5.0 // indirect
	github.com/fatih/color v1.15.0 // indirect
	github.com/fatih/structs v1.1.0 // indirect
	github.com/felixge/httpsnoop v1.0.4 // indirect
	github.com/go-logr/logr v1.4.2 // indirect
	github.com/go-logr/stdr v1.2.2 // indirect
	github.com/go-playground/locales v0.14.1 // indirect
	github.com/go-playground/universal-translator v0.18.1 // indirect
	github.com/gofrs/flock v0.12.1 // indirect
	github.com/gofrs/uuid v4.3.1+incompatible // indirect
	github.com/gogo/protobuf v1.3.2 // indirect
	github.com/golang-jwt/jwt v3.2.1+incompatible // indirect
	github.com/golang/groupcache v0.0.0-20210331224755-41bb18bfe9da // indirect
	github.com/golang/protobuf v1.5.4 // indirect
	github.com/google/go-cmp v0.6.0 // indirect
	github.com/google/go-querystring v0.0.0-20170111101155-53e6ce116135 // indirect
	github.com/google/uuid v1.6.0 // indirect
	github.com/grpc-ecosystem/grpc-gateway/v2 v2.22.0 // indirect
	github.com/hashicorp/errwrap v1.1.0 // indirect
	github.com/hashicorp/go-immutable-radix v1.3.1 // indirect
	github.com/hashicorp/go-memdb v1.3.4 // indirect
	github.com/hashicorp/go-multierror v1.1.1 // indirect
	github.com/hashicorp/golang-lru v0.5.4 // indirect
	github.com/huandu/xstrings v1.3.1 // indirect
	github.com/imdario/mergo v0.3.15 // indirect
	github.com/in-toto/in-toto-golang v0.5.0 // indirect
	github.com/json-iterator/go v1.1.12 // indirect
	github.com/kballard/go-shellquote v0.0.0-20180428030007-95032a82bc51 // indirect
	github.com/klauspost/compress v1.17.11 // indirect
	github.com/klauspost/pgzip v1.2.6-0.20220930104621-17e8dac29df8 // indirect
	github.com/kr/text v0.2.0 // indirect
	github.com/kyokomi/emoji/v2 v2.2.8 // indirect
	github.com/leodido/go-urn v1.2.2 // indirect
	github.com/mattn/go-colorable v0.1.13 // indirect
	github.com/mattn/go-isatty v0.0.17 // indirect
	github.com/mgutz/ansi v0.0.0-20170206155736-9520e82c474b // indirect
	github.com/mitchellh/copystructure v1.0.0 // indirect
	github.com/mitchellh/reflectwalk v1.0.0 // indirect
	github.com/moby/locker v1.0.1 // indirect
	github.com/moby/patternmatcher v0.6.0 // indirect
	github.com/moby/sys/mountinfo v0.7.2 // indirect
	github.com/moby/sys/sequential v0.6.0 // indirect
	github.com/moby/sys/signal v0.7.1 // indirect
	github.com/moby/sys/userns v0.1.0 // indirect
	github.com/modern-go/concurrent v0.0.0-20180306012644-bacd9c7ef1dd // indirect
	github.com/modern-go/reflect2 v1.0.2 // indirect
	github.com/opencontainers/runc v1.1.14 // indirect
	github.com/opencontainers/runtime-spec v1.2.0 // indirect
	github.com/planetscale/vtprotobuf v0.6.1-0.20240319094008-0393e58bdf10 // indirect
	github.com/pmezard/go-difflib v1.0.1-0.20181226105442-5d4384ee4fb2 // indirect
	github.com/russross/blackfriday/v2 v2.1.0 // indirect
	github.com/secure-systems-lab/go-securesystemslib v0.4.0 // indirect
	github.com/shibumi/go-pathspec v1.3.0 // indirect
	github.com/shopspring/decimal v1.2.0 // indirect
	github.com/sirupsen/logrus v1.9.3 // indirect
	github.com/spf13/cast v1.3.1 // indirect
	github.com/spf13/pflag v1.0.5 // indirect
	github.com/syndtr/gocapability v0.0.0-20200815063812-42c35b437635 // indirect
	github.com/tonistiigi/fsutil v0.0.0-20250113203817-b14e27f4135a // indirect
	github.com/tonistiigi/go-csvvalue v0.0.0-20240710180619-ddb21b71c0b4 // indirect
	github.com/trivago/tgo v1.0.7 // indirect
	github.com/tsuyoshiwada/go-gitcmd v0.0.0-20180205145712-5f1f5f9475df // indirect
	github.com/ulikunitz/xz v0.5.11 // indirect
	github.com/urfave/cli/v2 v2.27.5 // indirect
	github.com/vbatts/tar-split v0.11.6 // indirect
	github.com/xrash/smetrics v0.0.0-20240521201337-686a1a2994c1 // indirect
	go.opencensus.io v0.24.0 // indirect
	go.opentelemetry.io/contrib/instrumentation/google.golang.org/grpc/otelgrpc v0.56.0 // indirect
	go.opentelemetry.io/contrib/instrumentation/net/http/httptrace/otelhttptrace v0.56.0 // indirect
	go.opentelemetry.io/contrib/instrumentation/net/http/otelhttp v0.56.0 // indirect
	go.opentelemetry.io/otel v1.31.0 // indirect
	go.opentelemetry.io/otel/exporters/otlp/otlptrace v1.31.0 // indirect
	go.opentelemetry.io/otel/metric v1.31.0 // indirect
	go.opentelemetry.io/otel/sdk v1.31.0 // indirect
	go.opentelemetry.io/otel/trace v1.31.0 // indirect
	go.opentelemetry.io/proto/otlp v1.3.1 // indirect
	golang.org/x/crypto v0.31.0 // indirect
	golang.org/x/exp v0.0.0-20241108190413-2d47ceb2692f // indirect
	golang.org/x/net v0.33.0 // indirect
	golang.org/x/sys v0.29.0 // indirect
	golang.org/x/term v0.27.0 // indirect
	golang.org/x/text v0.21.0 // indirect
	golang.org/x/tools v0.27.0 // indirect
	google.golang.org/genproto/googleapis/api v0.0.0-20241021214115-324edc3d5d38 // indirect
	google.golang.org/genproto/googleapis/rpc v0.0.0-20241021214115-324edc3d5d38 // indirect
	google.golang.org/grpc v1.69.4 // indirect
	google.golang.org/protobuf v1.35.2 // indirect
	gopkg.in/go-playground/assert.v1 v1.2.1 // indirect
	gopkg.in/yaml.v2 v2.4.0 // indirect
	gopkg.in/yaml.v3 v3.0.1 // indirect
)

// Needed to avoid go mod error:
//   module declares its path as: github.com/sirupsen/logrus
//     but was required as: github.com/Sirupsen/logrus
// See https://github.com/moby/moby/issues/42939
replace github.com/docker/docker => github.com/docker/docker v20.10.3-0.20220414164044-61404de7df1a+incompatible

go 1.23.5
