{
  "name": "query+embeddedin",
  "mode": "list",
  "fieldname": "embeddedin",
  "fields": [
    {
      "name": "pageid",
      "type_": "u32",
      "prop": "=default"
    },
    {
      "name": "ns",
      "type_": "i32",
      "prop": "=default"
    },
    {
      "name": "title",
      "type_": "String",
      "prop": "=default"
    }
  ],
  "test_extra": {
    "assert": {},
    "params": {
      "eititle": "Template:Stub"
    }
  }
}
