month	active editors	active editors developed wikis	active editors emerging wikis	new active editors	new active editors developed wikis	new active editors emerging wikis	active administrators	active administrators developed wikis	active administrators emerging wikis	account registrations	account registrations developed wikis	account registrations emerging wikis	active editors represented regions	active editors underrepresented regions	returning active editors
2001-01-01	6	6	0	6	6	0									0
2001-02-01	9	9	0	4	4	0									5
2001-03-01	19	19	1	12	12	1									7
2001-04-01	18	18	0	5	5	0									13
2001-05-01	21	20	1	6	5	1									15
2001-06-01	24	23	1	2	2	0									22
2001-07-01	43	42	1	21	21	0									22
2001-08-01	53	52	1	15	15	0									38
2001-09-01	87	87	0	36	36	0									51
2001-10-01	103	100	3	26	24	2									77
2001-11-01	137	125	19	42	33	9									95
2001-12-01	146	136	17	49	45	4									97
2002-01-01	145	132	19	31	29	3									114
2002-02-01	176	159	20	57	52	6									119
2002-03-01	201	179	26	56	49	8									145
2002-04-01	177	152	32	34	31	4									143
2002-05-01	162	143	24	31	27	4									131
2002-06-01	191	173	22	50	46	4									141
2002-07-01	221	202	22	69	65	4									152
2002-08-01	310	285	33	111	106	6									199
2002-09-01	405	380	35	153	149	6									252
2002-10-01	448	404	61	169	149	24									279
2002-11-01	478	416	83	162	135	34									316
2002-12-01	544	449	119	184	146	41									360
2003-01-01	808	713	119	358	320	42									450
2003-02-01	885	785	137	327	294	38									558
2003-03-01	762	657	146	207	175	35									555
2003-04-01	803	676	159	241	196	48									562
2003-05-01	1135	988	185	430	390	45									705
2003-06-01	1265	1090	215	414	343	73									851
2003-07-01	1507	1282	285	584	499	97									923
2003-08-01	1799	1454	439	699	537	170									1100
2003-09-01	1828	1517	399	644	538	116									1184
2003-10-01	2006	1733	346	693	620	82									1313
2003-11-01	2401	2027	469	888	743	160									1513
2003-12-01	2688	2249	560	874	699	182									1814
2004-01-01	3038	2566	588	1061	878	187									1977
2004-02-01	4217	3560	805	1789	1513	307									2428
2004-03-01	6653	5731	1127	3228	2797	479									3425
2004-04-01	6171	5176	1199	2120	1737	409									4051
2004-05-01	6668	5562	1352	2194	1786	426									4474
2004-06-01	7124	6000	1374	2215	1835	413									4909
2004-07-01	8285	6997	1564	2752	2257	535									5533
2004-08-01	8527	7183	1643	2605	2134	504									5922
2004-09-01	9765	8085	2012	3056	2423	665									6709
2004-10-01	10932	8997	2272	3453	2685	808									7479
2004-11-01	12498	10089	2934	4084	3082	1049									8414
2004-12-01	13169	10611	3157	3868	2870	1035	579.0	349.0	261.0						9301
2005-01-01	13654	10925	3357	4091	3040	1136	789.0	456.0	386.0						9563
2005-02-01	13712	10806	3559	3820	2803	1050	821.0	463.0	403.0						9892
2005-03-01	16032	12716	4091	4808	3608	1256	904.0	501.0	453.0						11224
2005-04-01	19135	15130	4883	5890	4327	1632	987.0	541.0	508.0						13245
2005-05-01	20749	16531	5183	6166	4716	1521	1069.0	569.0	565.0						14583
2005-06-01	22610	17941	5717	6794	5189	1684	1081.0	588.0	561.0						15816
2005-07-01	26469	21482	6182	8574	6802	1868	1171.0	627.0	608.0						17895
2005-08-01	29796	24054	7053	9762	7555	2302	1232.0	662.0	638.0	9.0	9.0	0.0			20034
2005-09-01	27232	21996	6505	7250	5601	1695	1311.0	706.0	671.0	89972.0	69981.0	19991.0			19982
2005-10-01	30862	24940	7281	9087	7028	2116	1407.0	769.0	711.0	147052.0	114948.0	32104.0			21775
2005-11-01	31268	25371	7186	9087	7149	2006	1522.0	813.0	784.0	147115.0	115790.0	31325.0			22181
2005-12-01	43424	35847	9221	16196	13268	3049	1647.0	893.0	840.0	190297.0	152434.0	37863.0			27228
2006-01-01	51237	41777	11372	18328	14394	4036	1781.0	958.0	912.0	222396.0	173994.0	48402.0			32909
2006-02-01	52557	43328	11109	17655	14251	3498	1754.0	940.0	900.0	238275.0	188126.0	50149.0			34902
2006-03-01	60900	50083	12999	21032	16898	4313	1863.0	994.0	971.0	302131.0	233454.0	68677.0			39868
2006-04-01	63010	51844	13349	20709	16708	4148	1932.0	1018.0	1016.0	298725.0	233132.0	65593.0			42301
2006-05-01	70623	58137	14982	23424	18868	4770	2008.0	1063.0	1057.0	334395.0	259072.0	75323.0			47199
2006-06-01	71595	59032	15080	22259	18037	4398	2046.0	1083.0	1075.0	304897.0	238479.0	66418.0			49336
2006-07-01	75606	62413	15839	23854	19221	4836	2080.0	1096.0	1092.0	316808.0	249389.0	67419.0			51752
2006-08-01	83449	69193	17078	26697	21808	5124	2084.0	1109.0	1097.0	379604.0	300047.0	79557.0			56752
2006-09-01	82228	67742	17192	24582	19751	4991	2189.0	1151.0	1156.0	398839.0	310106.0	88733.0			57646
2006-10-01	86107	70927	17961	26136	20849	5434	2272.0	1177.0	1217.0	444443.0	342381.0	102062.0			59971
2006-11-01	91801	75975	18685	28570	23107	5684	2360.0	1232.0	1254.0	483183.0	372091.0	111092.0			63231
2006-12-01	92981	76305	19478	27127	21594	5674	2459.0	1258.0	1322.0	409678.0	316181.0	93497.0			65854
2007-01-01	102999	84371	21771	31547	25063	6698	2512.0	1285.0	1369.0	466306.0	363484.0	102822.0			71452
2007-02-01	101230	83317	20794	30333	24620	5886	2497.0	1300.0	1339.0	480889.0	375545.0	105344.0			70897
2007-03-01	107727	88426	22418	32389	25956	6569	2595.0	1298.0	1436.0	513982.0	394992.0	118990.0			75338
2007-04-01	105947	86594	22529	30668	24556	6274	2637.0	1322.0	1457.0	485044.0	372872.0	112172.0			75279
2007-05-01	106300	85995	23663	30470	23851	6788	2737.0	1388.0	1494.0	473054.0	360764.0	112290.0			75830
2007-06-01	97305	78126	22522	25920	20134	5954	2707.0	1352.0	1500.0	395837.0	304980.0	90857.0			71385
2007-07-01	97725	78970	22182	26478	20827	5804	2727.0	1376.0	1486.0	394603.0	311938.0	82665.0			71247
2007-08-01	96899	77889	22488	25688	19955	5909	2757.0	1387.0	1508.0	408025.0	315090.0	92935.0			71211
2007-09-01	95965	76789	22633	25967	20212	5924	2772.0	1401.0	1525.0	436829.0	334197.0	102632.0			69998
2007-10-01	99521	79676	23237	27676	21584	6259	2825.0	1453.0	1517.0	471444.0	356592.0	114852.0			71845
2007-11-01	94379	75176	22457	25025	19364	5786	2867.0	1477.0	1533.0	393808.0	295225.0	98583.0			69354
2007-12-01	90897	71514	22659	22865	17214	5816	2871.0	1471.0	1555.0	336890.0	247201.0	89689.0			68032
2008-01-01	100063	78665	25058	27755	21044	6831	2972.0	1488.0	1645.0	451599.0	336717.0	114882.0			72308
2008-02-01	98934	77833	24693	26995	20836	6357	2960.0	1484.0	1633.0	436494.0	323128.0	113366.0			71939
2008-03-01	103304	82035	25128	28217	21914	6491	3010.0	1505.0	1658.0	432736.0	317452.0	115284.0			75087
2008-04-01	100468	79457	24656	27128	20969	6328	2954.0	1490.0	1619.0	408674.0	303433.0	105241.0			73340
2008-05-01	100615	79321	25120	26349	20229	6312	3081.0	1605.0	1640.0	395650.0	292475.0	103175.0			74266
2008-06-01	93587	73866	23596	23234	17782	5611	3001.0	1536.0	1613.0	343338.0	252087.0	91251.0			70353
2008-07-01	94622	74589	24117	23738	18131	5848	2965.0	1504.0	1611.0	325405.0	238464.0	86941.0			70884
2008-08-01	93571	73454	24152	23009	17704	5462	3033.0	1563.0	1611.0	341661.0	255880.0	85781.0			70562
2008-09-01	91611	71782	23510	23077	17729	5443	3228.0	1749.0	1643.0	354507.0	267629.0	86878.0			68534
2008-10-01	95135	74193	24660	25350	19224	6280	3268.0	1735.0	1691.0	379444.0	287261.0	92183.0			69785
2008-11-01	92167	71763	24028	23241	17650	5711	3159.0	1517.0	1799.0	345824.0	261920.0	83904.0			68926
2008-12-01	90369	70093	24056	22123	16840	5496	3148.0	1495.0	1806.0	298010.0	226148.0	71862.0			68246
2009-01-01	97636	75630	26120	25120	19040	6433	3159.0	1571.0	1758.0	378122.0	284080.0	94042.0			72516
2009-02-01	92992	72336	24597	23294	17825	5714	3106.0	1561.0	1695.0	363056.0	274484.0	88572.0			69698
2009-03-01	98013	76175	25897	25048	19075	6251	3158.0	1571.0	1753.0	396794.0	296975.0	99819.0			72965
2009-04-01	92487	71512	24981	22428	16847	5747	3047.0	1511.0	1683.0	356502.0	268621.0	87881.0			70059
2009-05-01	95221	73464	25969	23356	17520	6160	3049.0	1518.0	1678.0	362246.0	269303.0	92943.0			71865
2009-06-01	93980	72516	25696	23004	17191	6035	3073.0	1519.0	1701.0	336378.0	253977.0	82401.0			70976
2009-07-01	93609	72485	25387	23189	17544	5971	2985.0	1473.0	1666.0	322504.0	247022.0	75482.0			70420
2009-08-01	92927	71576	25741	21932	16476	5842	3008.0	1456.0	1710.0	349401.0	267211.0	82190.0			70995
2009-09-01	90237	69529	24916	21310	16115	5510	3083.0	1493.0	1761.0	355555.0	269422.0	86133.0			68927
2009-10-01	92963	71470	25675	23063	17310	5998	3274.0	1685.0	1751.0	375794.0	282509.0	93285.0			69900
2009-11-01	92401	70728	25577	22470	16675	5935	3029.0	1459.0	1726.0	353987.0	265257.0	88730.0			69931
2009-12-01	90003	68578	25248	20861	15465	5610	3025.0	1469.0	1714.0	314787.0	236827.0	77960.0			69142
2010-01-01	96350	73517	27015	23803	17531	6527	3110.0	1514.0	1754.0	378011.0	283924.0	94087.0			72547
2010-02-01	91163	69929	25064	21951	16508	5616	3012.0	1452.0	1707.0	349572.0	266718.0	82854.0			69212
2010-03-01	96231	73540	26823	24182	17914	6489	3115.0	1522.0	1748.0	378651.0	283853.0	94798.0			72049
2010-04-01	92282	70550	25805	21854	16390	5633	3014.0	1446.0	1717.0	345450.0	256993.0	88457.0			70428
2010-05-01	93684	71707	26084	22102	16559	5723	3065.0	1454.0	1765.0	344990.0	256840.0	88150.0			71582
2010-06-01	87563	66478	25146	19615	14435	5356	2979.0	1415.0	1716.0	289465.0	212354.0	77111.0			67948
2010-07-01	85087	65076	24138	18745	14004	4968	2856.0	1393.0	1610.0	262860.0	196051.0	66809.0			66342
2010-08-01	86513	66228	24683	19286	14530	4972	2914.0	1400.0	1660.0	268478.0	203111.0	65367.0			67227
2010-09-01	83742	63808	24104	18449	13748	4929	2903.0	1337.0	1704.0	275639.0	208098.0	67541.0			65293
2010-10-01	85359	64970	24327	19429	14336	5166	2914.0	1353.0	1706.0	292530.0	220704.0	71826.0			65930
2010-11-01	85010	64054	24679	19641	14166	5468	2909.0	1347.0	1706.0	297663.0	221904.0	75759.0			65369
2010-12-01	83662	62816	24435	18583	13446	5280	2879.0	1361.0	1650.0	271708.0	197139.0	74569.0			65079
2011-01-01	93349	70147	27389	22746	16433	6520	3036.0	1444.0	1749.0	324255.0	236948.0	87307.0			70603
2011-02-01	88358	66703	25559	20748	15204	5711	2942.0	1393.0	1689.0	309401.0	228381.0	81020.0			67610
2011-03-01	91544	69159	26496	22150	16286	6003	2961.0	1396.0	1701.0	342509.0	254735.0	87774.0			69394
2011-04-01	87451	66019	25316	20174	14896	5443	2887.0	1362.0	1661.0	307058.0	230951.0	76107.0			67277
2011-05-01	88244	66216	25916	20244	14706	5686	2931.0	1382.0	1686.0	309732.0	231795.0	77937.0			68000
2011-06-01	86433	64780	25750	19816	14248	5737	2871.0	1362.0	1655.0	288754.0	219675.0	69079.0			66617
2011-07-01	85806	64702	25406	19137	13989	5415	2889.0	1372.0	1658.0	287584.0	221415.0	66169.0			66669
2011-08-01	86273	65089	25778	18906	13883	5278	2907.0	1351.0	1687.0	305581.0	234577.0	71004.0			67367
2011-09-01	86288	63410	27340	20354	13496	7046	2866.0	1315.0	1684.0	320803.0	233849.0	86954.0			65934
2011-10-01	85314	63370	26200	19251	13474	5890	2817.0	1295.0	1653.0	332067.0	238503.0	93564.0			66063
2011-11-01	84865	62640	26345	19264	13483	5970	2808.0	1272.0	1663.0	325762.0	238596.0	87166.0			65601
2011-12-01	84072	61876	26523	18141	12516	5826	2825.0	1316.0	1649.0	283458.0	206686.0	76772.0			65931
2012-01-01	89084	65589	28157	20763	14316	6639	2893.0	1306.0	1722.0	332786.0	244017.0	88769.0			68321
2012-02-01	85804	63564	26582	19560	13934	5804	2864.0	1320.0	1684.0	314714.0	231467.0	83247.0			66244
2012-03-01	85896	63607	26678	19230	13599	5719	2844.0	1290.0	1685.0	304781.0	222462.0	82319.0			66666
2012-04-01	84295	62096	26474	18005	12441	5750	2799.0	1247.0	1674.0	280026.0	203236.0	76790.0			66290
2012-05-01	86387	63485	27133	18357	12680	5805	2860.0	1275.0	1712.0	287477.0	209147.0	78330.0			68030
2012-06-01	83252	61360	26292	17526	12167	5498	2747.0	1240.0	1637.0	267778.0	193418.0	74360.0			65726
2012-07-01	84841	63170	26259	17999	12873	5400	2768.0	1247.0	1645.0	272708.0	199272.0	73436.0			66842
2012-08-01	83386	62342	25445	17003	12043	5030	2700.0	1216.0	1607.0	276772.0	201946.0	74826.0			66383
2012-09-01	86215	59251	31584	21115	11073	10262	2733.0	1219.0	1635.0	310839.0	201837.0	109002.0			65100
2012-10-01	83876	61365	26822	17771	12066	5799	2780.0	1239.0	1660.0	310674.0	221281.0	89393.0			66105
2012-11-01	83562	61292	26377	17534	12074	5566	2790.0	1237.0	1690.0	317353.0	230885.0	86468.0			66028
2012-12-01	82183	59901	26571	16174	11006	5283	2745.0	1235.0	1638.0	274933.0	200391.0	74542.0			66009
2013-01-01	88852	63996	29449	19027	12426	6836	2839.0	1249.0	1731.0	298708.0	210974.0	87734.0			69825
2013-02-01	81825	59854	26433	16690	11452	5424	2783.0	1197.0	1722.0	286889.0	208705.0	78184.0			65135
2013-03-01	86147	62740	28265	18285	12393	6026	2849.0	1249.0	1729.0	333802.0	244743.0	89059.0			67862
2013-04-01	86452	62331	28852	18934	12397	6677	2820.0	1220.0	1733.0	297283.0	207346.0	89937.0			67518
2013-05-01	87046	62275	29601	19259	12631	6744	2855.0	1233.0	1752.0	292532.0	208687.0	83845.0			67787
2013-06-01	80853	58571	27173	16510	11282	5481	2723.0	1167.0	1671.0	280465.0	198729.0	81736.0			64343
2013-07-01	80591	58838	26657	17247	12120	5404	2691.0	1182.0	1632.0	306556.0	222448.0	84108.0			63344
2013-08-01	79896	58398	26352	17008	11969	5178	2641.0	1120.0	1629.0	348436.0	257021.0	91415.0			62888
2013-09-01	80057	54281	30501	19459	10675	8861	2672.0	1149.0	1639.0	356039.0	243972.0	112067.0			60598
2013-10-01	79356	56771	26982	18067	12110	6023	2709.0	1166.0	1644.0	356870.0	257308.0	99562.0			61289
2013-11-01	78111	55892	26565	17537	11816	5657	2678.0	1157.0	1636.0	349432.0	248465.0	100967.0			60574
2013-12-01	78608	55982	27276	17376	11522	5930	2698.0	1178.0	1644.0	339511.0	239782.0	99729.0			61232
2014-01-01	84876	60142	29708	20101	13367	6840	2736.0	1178.0	1675.0	359107.0	256660.0	102447.0			64775
2014-02-01	78641	56145	27299	17572	11968	5704	2645.0	1143.0	1610.0	315678.0	224128.0	91550.0			61069
2014-03-01	82114	59082	27964	18938	12846	6143	2679.0	1145.0	1643.0	351382.0	250658.0	100724.0			63176
2014-04-01	79927	56813	27667	18423	12198	6109	2599.0	1107.0	1597.0	336941.0	241540.0	95401.0			61504
2014-05-01	85062	59514	30501	21585	13808	7801	2548.0	1091.0	1561.0	366018.0	263906.0	102112.0			63477
2014-06-01	78891	56133	27495	18573	12505	6168	2488.0	1081.0	1510.0	325910.0	239000.0	86910.0			60318
2014-07-01	80857	59109	26747	19557	13993	5723	2474.0	1062.0	1510.0	420489.0	323999.0	96490.0			61300
2014-08-01	80979	58748	27592	19267	13623	5847	2519.0	1071.0	1552.0	715210.0	567242.0	147968.0			61712
2014-09-01	79812	54991	29752	19931	11765	8305	2525.0	1068.0	1568.0	542464.0	407033.0	135431.0			59881
2014-10-01	81276	57462	28482	20535	13531	7027	2533.0	1050.0	1591.0	552599.0	420340.0	132259.0			60741
2014-11-01	79532	56565	27735	19341	12936	6540	2515.0	1068.0	1545.0	531354.0	404171.0	127183.0			60191
2014-12-01	80058	56770	28328	18661	12527	6197	2565.0	1073.0	1586.0	503895.0	384341.0	119554.0			61397
2015-01-01	86221	61204	30369	21416	14371	7151	2584.0	1085.0	1598.0	529782.0	403306.0	126476.0			64805
2015-02-01	82256	58368	28915	19897	13519	6386	2580.0	1102.0	1602.0	493497.0	373309.0	120188.0			62359
2015-03-01	88379	63284	30350	22238	15154	7103	2639.0	1107.0	1648.0	531553.0	395953.0	135600.0			66141
2015-04-01	82838	59253	28834	19117	12913	6262	2582.0	1067.0	1614.0	749170.0	580553.0	168617.0			63721
2015-05-01	86952	58906	33548	22144	12558	9723	2548.0	1067.0	1574.0	492898.0	359918.0	132980.0			64808
2015-06-01	82183	57778	29577	19500	12759	6779	2509.0	1060.0	1525.0	441729.0	322294.0	119435.0			62683
2015-07-01	80537	57925	28514	18070	12366	5973	2453.0	1054.0	1485.0	366064.0	269240.0	96824.0			62467
2015-08-01	79247	57326	27843	16848	11756	5365	2519.0	1043.0	1578.0	346377.0	255206.0	91171.0			62399
2015-09-01	79702	55278	30126	17668	10673	7125	2515.0	1057.0	1549.0	367531.0	266527.0	101004.0			62034
2015-10-01	80400	56795	29035	17485	11223	6185	2550.0	1065.0	1572.0	395901.0	290623.0	105278.0			62915
2015-11-01	81191	56702	29440	17934	10920	6566	2605.0	1079.0	1617.0	379782.0	274726.0	105056.0			63257
2015-12-01	79427	54887	29238	16842	10168	6370	2557.0	1052.0	1591.0	350945.0	255146.0	95799.0			62585
2016-01-01	85747	59237	31672	19315	11978	6986	2648.0	1103.0	1646.0	391614.0	287293.0	104321.0			66432
2016-02-01	81492	56503	29881	18153	11337	6317	2567.0	1053.0	1598.0	368076.0	268284.0	99792.0			63339
2016-03-01	85258	59334	30904	19270	12145	6835	2575.0	1061.0	1614.0	363440.0	260843.0	102597.0			65988
2016-04-01	82275	57162	29907	17696	11041	6165	2504.0	1040.0	1561.0	332213.0	238257.0	93956.0			64579
2016-05-01	86168	57482	33408	19882	10969	8422	2511.0	1064.0	1541.0	316434.0	222304.0	94130.0			66286
2016-06-01	83382	54805	33162	20117	10405	9446	2454.0	1032.0	1521.0	279062.0	186831.0	92231.0			63265
2016-07-01	78220	54814	29005	15885	10275	5642	2438.0	1028.0	1503.0	255870.0	181831.0	74039.0			62335
2016-08-01	78567	55844	28366	16118	10712	5586	3065.0	1428.0	1756.0	279416.0	200938.0	78478.0			62449
2016-09-01	80932	54363	32297	18816	10541	8356	4633.0	2518.0	2274.0	314823.0	217585.0	97238.0			62116
2016-10-01	79262	55449	29284	16837	10901	5875	4638.0	2483.0	2325.0	323409.0	231944.0	91465.0			62425
2016-11-01	79775	55846	29140	16819	11113	5745	4722.0	2528.0	2345.0	327196.0	237355.0	89841.0			62956
2016-12-01	80861	56476	29824	16389	10531	5927	2597.0	1067.0	1617.0	292028.0	208710.0	83318.0			64472
2017-01-01	85461	60008	31237	18232	11912	6444	2528.0	1029.0	1590.0	332612.0	238977.0	93635.0			67229
2017-02-01	80467	56815	29421	16529	11013	5655	2527.0	1052.0	1574.0	330995.0	232998.0	97997.0			63938
2017-03-01	87376	61727	31269	19413	12943	6509	2521.0	1025.0	1588.0	361036.0	255506.0	105530.0			67963
2017-04-01	82599	58224	29937	16697	10996	5862	2499.0	1009.0	1581.0	332638.0	230767.0	101871.0			65902
2017-05-01	85955	58405	32988	19307	11111	8212	2544.0	999.0	1637.0	338593.0	231176.0	107417.0			66648
2017-06-01	81603	55116	31962	18573	10235	8494	2406.0	974.0	1512.0	304836.0	200736.0	104100.0			63030
2017-07-01	80102	56065	29929	16012	10470	5771	2406.0	982.0	1507.0	287937.0	206633.0	81304.0			64090
2017-08-01	79304	56243	28898	15149	10248	5054	2419.0	949.0	1561.0	295253.0	215114.0	80139.0			64155
2017-09-01	79634	53545	31589	16680	9174	7479	2431.0	991.0	1533.0	303367.0	209344.0	94023.0			62954
2017-10-01	81031	56393	30288	16268	10067	6204	2495.0	996.0	1590.0	327589.0	230587.0	97002.0			64763
2017-11-01	82572	57016	31169	16591	10008	6667	2486.0	998.0	1570.0	331718.0	232759.0	98959.0			65981
2017-12-01	79466	55012	29917	14235	8845	5451	2439.0	995.0	1524.0	297010.0	210511.0	86499.0			65231
2018-01-01	84392	58762	31515	16513	10314	6311	2527.0	1020.0	1596.0	329841.0	236451.0	93390.0	66169.0	28228.0	67879
2018-02-01	78876	54671	29796	14799	9171	5584	2487.0	958.0	1615.0	303201.0	212050.0	91151.0	61646.0	26699.0	64077
2018-03-01	85900	60123	31536	17265	11037	6226	2500.0	1002.0	1580.0	326857.0	229873.0	96984.0	66916.0	28556.0	68635
2018-04-01	83390	58499	30400	15758	10146	5500	2480.0	984.0	1581.0	322542.0	227384.0	95158.0	63805.0	28428.0	67632
2018-05-01	85028	57753	32891	17376	10053	7296	2508.0	1016.0	1587.0	344915.0	242978.0	101937.0	63716.0	28424.0	67652
2018-06-01	78533	53696	30500	14885	8612	6336	2414.0	972.0	1524.0	309556.0	216412.0	93144.0	59578.0	26965.0	63648
2018-07-01	77987	54011	29714	13889	8552	5389	2433.0	994.0	1527.0	312990.0	226520.0	86470.0	59079.0	28593.0	64098
2018-08-01	78801	54812	30025	13825	8603	5395	2443.0	969.0	1567.0	328071.0	234116.0	93955.0	60348.0	28942.0	64976
2018-09-01	82335	52684	35020	17832	8477	9291	2427.0	972.0	1556.0	367013.0	241165.0	125848.0	57962.0	28292.0	64503
2018-10-01	82416	56033	31982	16325	9586	6745	2473.0	998.0	1572.0	366402.0	256486.0	109916.0	62689.0	28155.0	66091
2018-11-01	82243	56157	31619	15343	9419	5945	2488.0	989.0	1591.0	363358.0	253231.0	110127.0	64300.0	27725.0	66900
2018-12-01	80805	55128	31407	14529	8823	5832	2484.0	977.0	1594.0	341303.0	236860.0	104443.0	62846.0	28101.0	66276
2019-01-01	86793	58875	34080	16982	10177	6751	2557.0	1011.0	1647.0	371323.0	258174.0	113149.0	66743.0	29289.0	69811
2019-02-01	82565	54877	33380	16170	9001	7073	2463.0	989.0	1565.0	341332.0	234726.0	106606.0	63006.0	27159.0	66395
2019-03-01	87722	58831	34898	17547	10228	7398	2472.0	1004.0	1572.0	373097.0	255245.0	117852.0	67346.0	29789.0	70175
2019-04-01	84374	57239	32738	15334	9125	6314	2444.0	950.0	1575.0	304690.0	211055.0	93635.0	65024.0	28120.0	69040
2019-05-01	90225	57527	38758	19075	9043	10098	2416.0	960.0	1541.0	326798.0	216711.0	110087.0	66187.0	29222.0	71150
2019-06-01	83557	54419	35322	16863	8644	8397	2406.0	960.0	1531.0	302783.0	205127.0	97656.0	61263.0	28312.0	66694
2019-07-01	82597	55714	33232	15286	8912	6671	2425.0	968.0	1552.0	311905.0	208885.0	103020.0	62394.0	29697.0	67311
2019-08-01	82374	55781	32965	14879	8880	6161	2354.0	926.0	1506.0	316920.0	213450.0	103470.0	62473.0	29970.0	67495
2019-09-01	83171	53769	35557	16645	8556	8203	2421.0	974.0	1532.0	347814.0	231259.0	116555.0	60160.0	28991.0	66526
2019-10-01	85101	56971	34273	16542	9664	6980	2453.0	965.0	1572.0	363094.0	250078.0	113016.0	64055.0	30065.0	68559
2019-11-01	85859	56613	34950	16570	9312	7266	2438.0	980.0	1545.0	345819.0	239977.0	105842.0	64870.0	28829.0	69289
2019-12-01	85250	56138	34922	15601	8814	6949	2443.0	977.0	1553.0	331776.0	230839.0	100937.0	63927.0	29774.0	69649
2020-01-01	90242	58997	37249	18139	9781	8415	2485.0	995.0	1574.0	408210.0	249193.0	159017.0	68553.0	30907.0	72103
2020-02-01	88239	56847	37474	17826	9275	8527	2438.0	977.0	1561.0	361737.0	225935.0	135802.0	65580.0	29832.0	70413
2020-03-01	90459	58608	38747	18041	9612	8803	2495.0	988.0	1595.0	356686.0	231586.0	125100.0	67398.0	31739.0	72418
2020-04-01	96008	62428	41236	20363	11276	9700	2497.0	984.0	1601.0	389579.0	256153.0	133426.0	71840.0	33300.0	75645
2020-05-01	104520	65569	46464	24528	11928	12814	2493.0	989.0	1605.0	386380.0	251570.0	134810.0	73887.0	36419.0	79992
2020-06-01	96027	60983	42265	21074	10565	10931	2457.0	989.0	1560.0	341930.0	228996.0	112934.0	68167.0	33683.0	74953
2020-07-01	87698	55278	39183	18443	9271	9378	2412.0	967.0	1537.0	335635.0	232692.0	102943.0	65180.0	33451.0	69255
2020-08-01	89207	58530	37778	17542	9612	8282	2438.0	972.0	1563.0	305026.0	208806.0	96220.0	64873.0	33937.0	71665
2020-09-01	89416	57458	38685	17999	9328	8849	2455.0	966.0	1573.0	309151.0	205488.0	103663.0	63555.0	32876.0	71417
2020-10-01	90954	57851	39849	19163	9750	9665	2455.0	950.0	1593.0	322687.0	207844.0	114843.0	65714.0	32928.0	71791
2020-11-01	91790	58733	39998	18373	9419	9143	2419.0	961.0	1544.0	312120.0	202298.0	109822.0	68206.0	31788.0	73417
2020-12-01	94111	59995	41220	18439	9502	9308	2438.0	972.0	1557.0	320505.0	200270.0	120235.0	70878.0	32929.0	75672
2021-01-01	100217	64068	43635	21147	11106	10259	2557.0	1001.0	1652.0	366824.0	234690.0	132134.0	74786.0	35085.0	79070
2021-02-01	94106	60644	40494	18505	9845	8780	2512.0	998.0	1610.0	326079.0	204620.0	121459.0	70127.0	32478.0	75601
2021-03-01	100355	64408	43242	20465	10821	9853	2539.0	1008.0	1626.0	328254.0	212698.0	115556.0	73888.0	34940.0	79890
2021-04-01	97136	62429	42065	18647	9873	9189	2475.0	980.0	1585.0	291360.0	189037.0	102323.0	70808.0	34307.0	78489
2021-05-01	98744	63128	43162	19653	9913	10079	2450.0	987.0	1556.0	293468.0	189180.0	104288.0	70601.0	36266.0	79091
2021-06-01	91683	58376	40244	17528	8827	9092	2372.0	971.0	1490.0	258642.0	167893.0	90749.0	63323.0	35277.0	74155
2021-07-01	89323	58074	38529	16208	8518	8040	2388.0	976.0	1500.0	247945.0	155548.0	92397.0	62934.0	36025.0	73115
2021-08-01	90325	58462	39322	16123	8275	8195	2412.0	962.0	1540.0	274359.0	157815.0	116544.0	63497.0	36495.0	74202
2021-09-01	88935	56825	39174	16848	8337	8902	2413.0	980.0	1521.0	265543.0	165863.0	99680.0	61353.0	34550.0	72087
2021-10-01	90054	57330	39825	16921	8381	8717	2407.0	974.0	1534.0	277526.0	170065.0	107461.0	63720.0	34621.0	73133
2021-11-01	90005	57294	39519	16410	8217	8230	2379.0	928.0	1537.0	270378.0	163981.0	106397.0	65142.0	33129.0	73595
2021-12-01	89366	57335	39013	15866	8150	8064	2462.0	1017.0	1535.0	255794.0	160118.0	95676.0	65151.0	33427.0	73500
2022-01-01	94411	60694	40937	17601	9184	8626	2516.0	989.0	1619.0	274677.0	177081.0	97596.0	69945.0	34967.0	76810
2022-02-01	88297	56909	38629	16016	8343	7991	2419.0	957.0	1555.0	253919.0	164077.0	89842.0	65121.0	33172.0	72281
2022-03-01	91790	59583	39319	17607	9489	8537	2426.0	957.0	1561.0	267393.0	172370.0	95023.0	65918.0	35101.0	74183
2022-04-01	90156	57975	38969	16681	8602	8377	2392.0	942.0	1545.0	237490.0	153733.0	83757.0	65366.0	33373.0	73475
2022-05-01	92992	59417	40819	17945	9059	9402	2405.0	931.0	1559.0	247685.0	155674.0	92011.0	67231.0	34731.0	75047
2022-06-01	88304	56254	38842	16476	8184	8681	2316.0	914.0	1496.0	257205.0	169851.0	87354.0	63170.0	33300.0	71828
2022-07-01	88209	57069	38426	15746	8282	7921	2340.0	918.0	1504.0	221524.0	138250.0	83274.0	63598.0	34142.0	72463
2022-08-01	88055	57052	38176	15650	8187	7890	2340.0	919.0	1518.0	225181.0	138925.0	86256.0	63561.0	34352.0	72405
2022-09-01	87031	55232	38674	15830	7812	8288	2328.0	911.0	1516.0	248957.0	152285.0	96672.0	62152.0	32755.0	71201
2022-10-01	89943	57227	39608	16963	8493	8735	2410.0	946.0	1556.0	269727.0	162951.0	106776.0	65169.0	33740.0	72980
2022-11-01	88470	56227	38977	16012	8049	8549	2369.0	923.0	1539.0	263022.0	159381.0	103641.0	65367.0	32443.0	72458
2022-12-01	88845	56117	39518	15706	7761	8321	2364.0	936.0	1518.0	246047.0	150026.0	96021.0	65677.0	33123.0	73139
2023-01-01	94010	59795	41243	17906	9160	9021	2434.0	944.0	1583.0	293307.0	186944.0	106363.0	69124.0	34681.0	76104
2023-02-01	87939	54924	39710	16298	7920	8481	2334.0	913.0	1512.0	262526.0	160719.0	101807.0	63990.0	32429.0	71641
2023-03-01	93519	58630	41834	18140	8844	9460	2389.0	928.0	1550.0	291743.0	179570.0	112173.0	67164.0	34324.0	75379
2023-04-01	91012	57370	40334	16803	8419	8643	2337.0	889.0	1536.0	261651.0	162548.0	99103.0	65924.0	33291.0	74209
2023-05-01	91722	57490	40857	16775	8173	8764	2347.0	902.0	1533.0	259184.0	157293.0	101891.0	65968.0	33831.0	74947
2023-06-01	87969	54845	39780	16008	7691	8507	2321.0	924.0	1493.0	235773.0	141690.0	94083.0	62277.0	33519.0	71961
2023-07-01	87897	55680	39326	15504	7789	8000	2295.0	907.0	1481.0	222069.0	138303.0	83766.0	62807.0	33668.0	72393
2023-08-01	88070	56188	39212	14927	7601	7690	2302.0	883.0	1506.0	228399.0	146063.0	82336.0	64516.0	33962.0	73143
2023-09-01	86544	53951	39410	15168	7132	8392	2355.0	898.0	1545.0	235498.0	148748.0	86750.0	61907.0	32416.0	71376
2023-10-01	87430	55223	39348	15211	7431	7911	2349.0	890.0	1543.0	245239.0	154860.0	90379.0	63262.0	32865.0	72219
2023-11-01	87719	55279	39213	14898	7130	7969	2366.0	896.0	1553.0	265704.0	171206.0	94498.0	64747.0	31731.0	72821
2023-12-01	87017	55128	39063	14200	6988	7465	2350.0	891.0	1541.0	212017.0	133311.0	78706.0	64314.0	32832.0	72817
2024-01-01	91329	58373	40357	15524	7888	7805	2396.0	909.0	1575.0	242997.0	153354.0	89643.0	68255.0	33932.0	75805
2024-02-01	87553	55327	39324	14747	7102	7885	2287.0	857.0	1512.0	223251.0	138994.0	84257.0	65399.0	31480.0	72806
2024-03-01	90416	56879	40764	15255	7237	8214	2304.0	876.0	1524.0	226528.0	140851.0	85677.0	66502.0	32955.0	75161
2024-04-01	87788	55573	39169	14439	7039	7431	2299.0	875.0	1510.0	222282.0	141385.0	80897.0	65100.0	31339.0	73349
2024-05-01	88892	55638	40201	14912	7026	7962	2310.0	889.0	1510.0	226139.0	141429.0	84710.0	64802.0	32584.0	73980
2024-06-01	85187	53374	38976	14182	6550	7781	2261.0	880.0	1457.0	201569.0	127897.0	73672.0	61028.0	31690.0	71005
2024-07-01	85281	54593	37881	13611	6804	7069	2216.0	852.0	1452.0	199603.0	130793.0	68810.0	62138.0	32202.0	71670
2024-08-01	84227	53941	37256	12879	6381	6601	2227.0	835.0	1472.0	210634.0	140357.0	70277.0	62170.0	32976.0	71348
2024-09-01	82212	51730	37291	13261	6125	7159	2250.0	841.0	1491.0	211935.0	137496.0	74439.0	59889.0	30647.0	68951
2024-10-01	85812	53929	38756	14336	6815	7657	2290.0	835.0	1532.0	229053.0	143152.0	85901.0	62204.0	32431.0	71476
2024-11-01	84766	53509	37879	14059	6796	7329	2301.0	889.0	1487.0	213668.0	137090.0	76578.0	62585.0	31913.0	70707
2024-12-01	85340	54593	37969	13449	6493	6445	2310.0	891.0	1506.0	206263.0	133387.0	72876.0	63807.0	32644.0	71891
2025-01-01	89583	57212	39663	14897	7471	6779	2340.0	917.0	1514.0	226126.0	149372.0	76754.0	67514.0	33392.0	74686
