[
  {
    "id": 11609,
    "label": "SUPPORTS",
    "claim": "Frank Sinatra's middle name was Albert.",
    "evidence_annotation_id": 26790,
    "evidence_id": 32883,
    "evidence_wiki_url": "Frank_Sinatra",
    "evidence_sentence_id": -1
  },
  {
    "id": 17645,
    "label": "REFUTES",
    "claim": "Star Wars: The Force Awakens received only praise.",
    "evidence_annotation_id": 33139,
    "evidence_id": 40232,
    "evidence_wiki_url": "Star_Wars-COLON-_The_Force_Awakens",
    "evidence_sentence_id": 17
  },
  {
    "id": 57009,
    "label": "SUPPORTS",
    "claim": "Samuel L. Jackson was not in the M. Night Shyamalan film Unbreakable.",
    "evidence_annotation_id": 73343,
    "evidence_id": 84557,
    "evidence_wiki_url": "Unbreakable_-LRB-film-RRB-",
    "evidence_sentence_id": -1
  },
  {
    "id": 7886,
    "label": "SUPPORTS",
    "claim": "George W. Bush was a president.",
    "evidence_annotation_id": 299233,
    "evidence_id": 290615,
    "evidence_wiki_url": "George_W._Bush",
    "evidence_sentence_id": 29
  },
  {
    "id": 31973,
    "label": "SUPPORTS",
    "claim": "FC Barcelona was formed in 1899.",
    "evidence_annotation_id": 97022,
    "evidence_id": 110176,
    "evidence_wiki_url": "FC_Barcelona",
    "evidence_sentence_id": 3
  },
  {
    "id": 183049,
    "label": "SUPPORTS",
    "claim": "Snooki & Jwoww was renewed by MTV.",
    "evidence_annotation_id": 213071,
    "evidence_id": 220429,
    "evidence_wiki_url": "Snooki_&_Jwoww",
    "evidence_sentence_id": 9
  },
  {
    "id": 18056,
    "label": "REFUTES",
    "claim": "Katie Holmes refused to ever become an actress.",
    "evidence_annotation_id": 33580,
    "evidence_id": 40747,
    "evidence_wiki_url": "Katie_Holmes",
    "evidence_sentence_id": 7
  },
  {
    "id": 155083,
    "label": "SUPPORTS",
    "claim": "Alicia Silverstone was in an American film.",
    "evidence_annotation_id": 179156,
    "evidence_id": 191675,
    "evidence_wiki_url": "Alicia_Silverstone",
    "evidence_sentence_id": 1
  },
  {
    "id": 147095,
    "label": "NOT ENOUGH INFO",
    "claim": "Planet of the Apes' filming took place between May 21 and August 10, 1967.",
    "evidence_annotation_id": 172801,
    "evidence_id": -1,
    "evidence_wiki_url": "",
    "evidence_sentence_id": -1
  },
  {
    "id": 42877,
    "label": "REFUTES",
    "claim": "Gillian Anderson was born in Somalia to Somali parents.",
    "evidence_annotation_id": 59191,
    "evidence_id": 69537,
    "evidence_wiki_url": "Gillian_Anderson",
    "evidence_sentence_id": -1
  },
  {
    "id": 49685,
    "label": "SUPPORTS",
    "claim": "Red Hot Chili Peppers were originally named Tony Flow and the Miraculously Majestic Masters of Mayhem.",
    "evidence_annotation_id": 66009,
    "evidence_id": 76869,
    "evidence_wiki_url": "Red_Hot_Chili_Peppers",
    "evidence_sentence_id": 8
  },
  {
    "id": 7540,
    "label": "SUPPORTS",
    "claim": "Scarlett Johansson is an actress.",
    "evidence_annotation_id": 298945,
    "evidence_id": 290322,
    "evidence_wiki_url": "Lucy_-LRB-2014_film-RRB-",
    "evidence_sentence_id": 2
  },
  {
    "id": 152807,
    "label": "NOT ENOUGH INFO",
    "claim": "Italy experienced economic growth between 1494 to 1559.",
    "evidence_annotation_id": 176752,
    "evidence_id": -1,
    "evidence_wiki_url": "",
    "evidence_sentence_id": -1
  },
  {
    "id": 20999,
    "label": "SUPPORTS",
    "claim": "Ronald Reagan was a president.",
    "evidence_annotation_id": 57606,
    "evidence_id": 67839,
    "evidence_wiki_url": "United_States_presidential_election,_1984",
    "evidence_sentence_id": 2
  },
  {
    "id": 88304,
    "label": "SUPPORTS",
    "claim": "Jacqueline Kennedy Onassis was famous.",
    "evidence_annotation_id": 105521,
    "evidence_id": 118963,
    "evidence_wiki_url": "Jacqueline_Kennedy_Onassis",
    "evidence_sentence_id": 17
  },
  {
    "id": 87548,
    "label": "REFUTES",
    "claim": "Inhumans is developed only for ABC.",
    "evidence_annotation_id": 104753,
    "evidence_id": 118170,
    "evidence_wiki_url": "Inhumans_-LRB-TV_series-RRB-",
    "evidence_sentence_id": 14
  },
  {
    "id": 137180,
    "label": "SUPPORTS",
    "claim": "Pixar uses CGI animation to create films.",
    "evidence_annotation_id": 159927,
    "evidence_id": 174435,
    "evidence_wiki_url": "Pixar",
    "evidence_sentence_id": 3
  },
  {
    "id": 145207,
    "label": "SUPPORTS",
    "claim": "Laurence Olivier received American film awards.",
    "evidence_annotation_id": 168503,
    "evidence_id": 182241,
    "evidence_wiki_url": "Academy_Awards",
    "evidence_sentence_id": -1
  },
  {
    "id": 75681,
    "label": "REFUTES",
    "claim": "Bill Clinton was never acquitted by the U.S. Senate.",
    "evidence_annotation_id": 239418,
    "evidence_id": 241276,
    "evidence_wiki_url": "Bill_Clinton",
    "evidence_sentence_id": 21
  },
  {
    "id": 195721,
    "label": "NOT ENOUGH INFO",
    "claim": "A Nightmare on Elm Street stars Katie Cassidy and Rooney Mara.",
    "evidence_annotation_id": 229935,
    "evidence_id": -1,
    "evidence_wiki_url": "",
    "evidence_sentence_id": -1
  },
  {
    "id": 82782,
    "label": "SUPPORTS",
    "claim": "Paradise is an EP.",
    "evidence_annotation_id": 26827,
    "evidence_id": 32934,
    "evidence_wiki_url": "Born_to_Die",
    "evidence_sentence_id": 15
  },
  {
    "id": 200014,
    "label": "REFUTES",
    "claim": "Denial premiered at the Toronto International Film Festival in 1997.",
    "evidence_annotation_id": 235265,
    "evidence_id": 237960,
    "evidence_wiki_url": "Denial_-LRB-2016_film-RRB-",
    "evidence_sentence_id": 5
  },
  {
    "id": 110236,
    "label": "SUPPORTS",
    "claim": "Cyndi Lauper released a debut solo album.",
    "evidence_annotation_id": 130190,
    "evidence_id": 144925,
    "evidence_wiki_url": "Cyndi_Lauper",
    "evidence_sentence_id": 2
  },
  {
    "id": 150770,
    "label": "REFUTES",
    "claim": "The Coen brothers have only directed Barton Fink.",
    "evidence_annotation_id": 174580,
    "evidence_id": 187753,
    "evidence_wiki_url": "No_Country_for_Old_Men_-LRB-film-RRB-",
    "evidence_sentence_id": -1
  },
  {
    "id": 191392,
    "label": "SUPPORTS",
    "claim": "Frank Zappa's debut album was released in 1966.",
    "evidence_annotation_id": 223793,
    "evidence_id": 228731,
    "evidence_wiki_url": "Frank_Zappa",
    "evidence_sentence_id": 10
  },
  {
    "id": 74851,
    "label": "NOT ENOUGH INFO",
    "claim": "Hungary was only founded by Barack Obama.",
    "evidence_annotation_id": 320324,
    "evidence_id": -1,
    "evidence_wiki_url": "",
    "evidence_sentence_id": -1
  },
  {
    "id": 24540,
    "label": "SUPPORTS",
    "claim": "Blackhat stars an actor.",
    "evidence_annotation_id": 40489,
    "evidence_id": 48706,
    "evidence_wiki_url": "Wang_Leehom",
    "evidence_sentence_id": -1
  },
  {
    "id": 2022,
    "label": "SUPPORTS",
    "claim": "The Houston Rockets have won four Western Conference titles.",
    "evidence_annotation_id": 93358,
    "evidence_id": 106311,
    "evidence_wiki_url": "Houston_Rockets",
    "evidence_sentence_id": 3
  },
  {
    "id": 63851,
    "label": "SUPPORTS",
    "claim": "United Kingdom is a developed country.",
    "evidence_annotation_id": 201693,
    "evidence_id": 211086,
    "evidence_wiki_url": "United_Kingdom",
    "evidence_sentence_id": 31
  },
  {
    "id": 48130,
    "label": "SUPPORTS",
    "claim": "Margot Kidder won an award in the 2010s.",
    "evidence_annotation_id": 299634,
    "evidence_id": 291054,
    "evidence_wiki_url": "Margot_Kidder",
    "evidence_sentence_id": 11
  },
  {
    "id": 214205,
    "label": "NOT ENOUGH INFO",
    "claim": "Syria includes Jewish people.",
    "evidence_annotation_id": 254293,
    "evidence_id": -1,
    "evidence_wiki_url": "",
    "evidence_sentence_id": -1
  },
  {
    "id": 10929,
    "label": "SUPPORTS",
    "claim": "Serena Williams competes in women's singles and doubles.",
    "evidence_annotation_id": 27580,
    "evidence_id": 33778,
    "evidence_wiki_url": "Serena_Williams",
    "evidence_sentence_id": 15
  },
  {
    "id": 79067,
    "label": "SUPPORTS",
    "claim": "Muhammad is significant to religion.",
    "evidence_annotation_id": 26020,
    "evidence_id": 31968,
    "evidence_wiki_url": "Muhammad",
    "evidence_sentence_id": 23
  },
  {
    "id": 102947,
    "label": "SUPPORTS",
    "claim": "Leonardo da Vinci is a painter.",
    "evidence_annotation_id": 327259,
    "evidence_id": 314583,
    "evidence_wiki_url": "Leonardo_da_Vinci",
    "evidence_sentence_id": -1
  },
  {
    "id": 203959,
    "label": "REFUTES",
    "claim": "Laura Linney was in a movie.",
    "evidence_annotation_id": 240750,
    "evidence_id": 242330,
    "evidence_wiki_url": "Laura_Linney",
    "evidence_sentence_id": -1
  },
  {
    "id": 97155,
    "label": "SUPPORTS",
    "claim": "Alicia Silverstone appeared in a music video.",
    "evidence_annotation_id": 114747,
    "evidence_id": 128491,
    "evidence_wiki_url": "Alicia_Silverstone",
    "evidence_sentence_id": 1
  },
  {
    "id": 99275,
    "label": "REFUTES",
    "claim": "Dylan O'Brien is not a film actor.",
    "evidence_annotation_id": 325966,
    "evidence_id": 313572,
    "evidence_wiki_url": "Dylan_O'Brien",
    "evidence_sentence_id": 1
  },
  {
    "id": 50752,
    "label": "SUPPORTS",
    "claim": "Adele has an album called 25.",
    "evidence_annotation_id": 67105,
    "evidence_id": 77903,
    "evidence_wiki_url": "Adele",
    "evidence_sentence_id": 24
  },
  {
    "id": 70843,
    "label": "SUPPORTS",
    "claim": "Audrey Hepburn starred in a movie.",
    "evidence_annotation_id": 87516,
    "evidence_id": 99996,
    "evidence_wiki_url": "Audrey_Hepburn",
    "evidence_sentence_id": 11
  },
  {
    "id": 100959,
    "label": "SUPPORTS",
    "claim": "Asia contains places.",
    "evidence_annotation_id": 118666,
    "evidence_id": 132515,
    "evidence_wiki_url": "China",
    "evidence_sentence_id": -1
  },
  {
    "id": 193259,
    "label": "NOT ENOUGH INFO",
    "claim": "Edge of Tomorrow was released in Portugal.",
    "evidence_annotation_id": 226284,
    "evidence_id": -1,
    "evidence_wiki_url": "",
    "evidence_sentence_id": -1
  },
  {
    "id": 47506,
    "label": "SUPPORTS",
    "claim": "Her was given a wide release on January 10, 2014.",
    "evidence_annotation_id": 145113,
    "evidence_id": 160118,
    "evidence_wiki_url": "Her_-LRB-film-RRB-",
    "evidence_sentence_id": 16
  },
  {
    "id": 15879,
    "label": "SUPPORTS",
    "claim": "Sally Field was an actress.",
    "evidence_annotation_id": 31277,
    "evidence_id": 37994,
    "evidence_wiki_url": "Sally_Field",
    "evidence_sentence_id": 3
  },
  {
    "id": 84457,
    "label": "SUPPORTS",
    "claim": "Poppy is a Tennessean.",
    "evidence_annotation_id": 101503,
    "evidence_id": 114747,
    "evidence_wiki_url": "Poppy_-LRB-singer-RRB-",
    "evidence_sentence_id": 1
  },
  {
    "id": 210295,
    "label": "REFUTES",
    "claim": "Moana is a 2016 novel.",
    "evidence_annotation_id": 250970,
    "evidence_id": 250928,
    "evidence_wiki_url": "Moana_-LRB-2016_film-RRB-",
    "evidence_sentence_id": -1
  },
  {
    "id": 59010,
    "label": "SUPPORTS",
    "claim": "Just My Luck (2006 film) features Chris Pine in a lead role.",
    "evidence_annotation_id": 75401,
    "evidence_id": 86659,
    "evidence_wiki_url": "Just_My_Luck_-LRB-2006_film-RRB-",
    "evidence_sentence_id": 1
  },
  {
    "id": 87287,
    "label": "NOT ENOUGH INFO",
    "claim": "Maria Sharapova tested positive for a substance that has been banned by the president.",
    "evidence_annotation_id": 323546,
    "evidence_id": -1,
    "evidence_wiki_url": "",
    "evidence_sentence_id": -1
  },
  {
    "id": 25964,
    "label": "SUPPORTS",
    "claim": "Justin Bieber released at least four studio albums.",
    "evidence_annotation_id": 76292,
    "evidence_id": 87589,
    "evidence_wiki_url": "Justin_Bieber",
    "evidence_sentence_id": 11
  },
  {
    "id": 200906,
    "label": "NOT ENOUGH INFO",
    "claim": "Miyu Irino is a Voice contestant.",
    "evidence_annotation_id": 236391,
    "evidence_id": -1,
    "evidence_wiki_url": "",
    "evidence_sentence_id": -1
  },
  {
    "id": 191239,
    "label": "SUPPORTS",
    "claim": "100 Greatest of All Time first premiered on the Tennis Channel.",
    "evidence_annotation_id": 223600,
    "evidence_id": 228572,
    "evidence_wiki_url": "100_Greatest_of_All_Time",
    "evidence_sentence_id": -1
  },
  {
    "id": 197480,
    "label": "REFUTES",
    "claim": "Chris O'Dowd has starred only in films.",
    "evidence_annotation_id": 232160,
    "evidence_id": 235423,
    "evidence_wiki_url": "Chris_O'Dowd",
    "evidence_sentence_id": 6
  },
  {
    "id": 214033,
    "label": "REFUTES",
    "claim": "Jonathan Hensleigh directed Jumanji.",
    "evidence_annotation_id": 254076,
    "evidence_id": 253841,
    "evidence_wiki_url": "Jonathan_Hensleigh",
    "evidence_sentence_id": -1
  },
  {
    "id": 218285,
    "label": "SUPPORTS",
    "claim": "Dwayne Johnson was born in 1972.",
    "evidence_annotation_id": 259513,
    "evidence_id": 258106,
    "evidence_wiki_url": "Dwayne_Johnson",
    "evidence_sentence_id": -1
  },
  {
    "id": 140734,
    "label": "REFUTES",
    "claim": "Stanley Kubrick is not a director.",
    "evidence_annotation_id": 338222,
    "evidence_id": 323460,
    "evidence_wiki_url": "A_Clockwork_Orange_-LRB-film-RRB-",
    "evidence_sentence_id": -1
  },
  {
    "id": 126634,
    "label": "SUPPORTS",
    "claim": "Faith Evans is a person.",
    "evidence_annotation_id": 148493,
    "evidence_id": 163509,
    "evidence_wiki_url": "Faith_Evans",
    "evidence_sentence_id": 14
  },
  {
    "id": 163636,
    "label": "SUPPORTS",
    "claim": "There was a musician in the Grand Ole Pry.",
    "evidence_annotation_id": 188360,
    "evidence_id": 199760,
    "evidence_wiki_url": "Reba_McEntire",
    "evidence_sentence_id": -1
  },
  {
    "id": 9813,
    "label": "REFUTES",
    "claim": "Islam does not have any followers.",
    "evidence_annotation_id": 304442,
    "evidence_id": 295245,
    "evidence_wiki_url": "Islam",
    "evidence_sentence_id": 8
  },
  {
    "id": 119844,
    "label": "REFUTES",
    "claim": "The United Kingdom is the 21st-most populous city.",
    "evidence_annotation_id": 140845,
    "evidence_id": 155975,
    "evidence_wiki_url": "United_Kingdom",
    "evidence_sentence_id": 7
  },
  {
    "id": 116215,
    "label": "REFUTES",
    "claim": "Michael Jordan never played basketball.",
    "evidence_annotation_id": 136521,
    "evidence_id": 151301,
    "evidence_wiki_url": "Michael_Jordan",
    "evidence_sentence_id": 17
  },
  {
    "id": 222618,
    "label": "SUPPORTS",
    "claim": "The capital city of Austria is Vienna.",
    "evidence_annotation_id": 265193,
    "evidence_id": 262447,
    "evidence_wiki_url": "Austria",
    "evidence_sentence_id": 29
  },
  {
    "id": 35682,
    "label": "SUPPORTS",
    "claim": "The Miami Marlins are a team that plays baseball.",
    "evidence_annotation_id": 109317,
    "evidence_id": 122988,
    "evidence_wiki_url": "Miami_Marlins",
    "evidence_sentence_id": 16
  },
  {
    "id": 65035,
    "label": "SUPPORTS",
    "claim": "Birth of the Dragon comes out in summer 2017.",
    "evidence_annotation_id": 81510,
    "evidence_id": 93266,
    "evidence_wiki_url": "Birth_of_the_Dragon",
    "evidence_sentence_id": 5
  },
  {
    "id": 103566,
    "label": "SUPPORTS",
    "claim": "Emily Ratajkowski was in a commercial for an upscale car brand during a Super Bowl.",
    "evidence_annotation_id": 122379,
    "evidence_id": 136649,
    "evidence_wiki_url": "Emily_Ratajkowski",
    "evidence_sentence_id": 9
  },
  {
    "id": 19438,
    "label": "SUPPORTS",
    "claim": "Judi Dench is an actress.",
    "evidence_annotation_id": 35229,
    "evidence_id": 42719,
    "evidence_wiki_url": "Judi_Dench",
    "evidence_sentence_id": 2
  },
  {
    "id": 48439,
    "label": "SUPPORTS",
    "claim": "Liv Tyler performed in a television series.",
    "evidence_annotation_id": 64801,
    "evidence_id": 75644,
    "evidence_wiki_url": "Liv_Tyler",
    "evidence_sentence_id": 16
  },
  {
    "id": 28458,
    "label": "REFUTES",
    "claim": "Lil Wayne has kept his albums entirely to himself.",
    "evidence_annotation_id": 44588,
    "evidence_id": 53268,
    "evidence_wiki_url": "Lil_Wayne",
    "evidence_sentence_id": 22
  },
  {
    "id": 49116,
    "label": "SUPPORTS",
    "claim": "The Wachowskis wrote The Matrix.",
    "evidence_annotation_id": 150389,
    "evidence_id": 165284,
    "evidence_wiki_url": "The_Matrix",
    "evidence_sentence_id": 19
  },
  {
    "id": 60730,
    "label": "SUPPORTS",
    "claim": "Sleeping Beauty premiered in May 2011.",
    "evidence_annotation_id": 77430,
    "evidence_id": 88888,
    "evidence_wiki_url": "Sleeping_Beauty_-LRB-2011_film-RRB-",
    "evidence_sentence_id": 6
  },
  {
    "id": 135388,
    "label": "REFUTES",
    "claim": "Beauty Shop is an original work.",
    "evidence_annotation_id": 157987,
    "evidence_id": 172607,
    "evidence_wiki_url": "Beauty_Shop",
    "evidence_sentence_id": -1
  },
  {
    "id": 58036,
    "label": "SUPPORTS",
    "claim": "Philadelphia contains 67 National Historic Landmarks.",
    "evidence_annotation_id": 187026,
    "evidence_id": 198739,
    "evidence_wiki_url": "Philadelphia",
    "evidence_sentence_id": 20
  },
  {
    "id": 88042,
    "label": "SUPPORTS",
    "claim": "Eddie Redmayne appeared in a film.",
    "evidence_annotation_id": 105250,
    "evidence_id": 118672,
    "evidence_wiki_url": "The_Theory_of_Everything_-LRB-2014_film-RRB-",
    "evidence_sentence_id": 7
  },
  {
    "id": 78158,
    "label": "NOT ENOUGH INFO",
    "claim": "Amelia Earhart was Canadian.",
    "evidence_annotation_id": 95098,
    "evidence_id": -1,
    "evidence_wiki_url": "",
    "evidence_sentence_id": -1
  },
  {
    "id": 205829,
    "label": "REFUTES",
    "claim": "The Dodecanese are in the southeastern Tyrrhenian Sea.",
    "evidence_annotation_id": 243247,
    "evidence_id": 244488,
    "evidence_wiki_url": "Dodecanese",
    "evidence_sentence_id": -1
  },
  {
    "id": 7152,
    "label": "NOT ENOUGH INFO",
    "claim": "Death in Paradise has enjoyed high ratings and is highly acclaimed.",
    "evidence_annotation_id": 11743,
    "evidence_id": -1,
    "evidence_wiki_url": "",
    "evidence_sentence_id": -1
  },
  {
    "id": 81349,
    "label": "SUPPORTS",
    "claim": "London is in Greater London.",
    "evidence_annotation_id": 263977,
    "evidence_id": 261504,
    "evidence_wiki_url": "London",
    "evidence_sentence_id": 22
  },
  {
    "id": 225010,
    "label": "SUPPORTS",
    "claim": "Equidae includes some species known only from their bones.",
    "evidence_annotation_id": 268136,
    "evidence_id": 264765,
    "evidence_wiki_url": "Equidae",
    "evidence_sentence_id": -1
  },
  {
    "id": 89571,
    "label": "SUPPORTS",
    "claim": "The Eagles were active in the 1970s.",
    "evidence_annotation_id": 106804,
    "evidence_id": 120196,
    "evidence_wiki_url": "Eagles_-LRB-band-RRB-",
    "evidence_sentence_id": 2
  },
  {
    "id": 115258,
    "label": "NOT ENOUGH INFO",
    "claim": "The 2013 NBA draft was planned at Barclays Center in Brooklyn.",
    "evidence_annotation_id": 330575,
    "evidence_id": -1,
    "evidence_wiki_url": "",
    "evidence_sentence_id": -1
  },
  {
    "id": 80024,
    "label": "REFUTES",
    "claim": "Alex Rodriguez was suspended for 500 games.",
    "evidence_annotation_id": 96982,
    "evidence_id": 110140,
    "evidence_wiki_url": "Alex_Rodriguez",
    "evidence_sentence_id": 28
  },
  {
    "id": 147934,
    "label": "SUPPORTS",
    "claim": "Mickey Rooney was in a movie.",
    "evidence_annotation_id": 171562,
    "evidence_id": 185030,
    "evidence_wiki_url": "Mickey_Rooney",
    "evidence_sentence_id": 14
  },
  {
    "id": 51226,
    "label": "SUPPORTS",
    "claim": "Mission: Impossible 6 is written by a person.",
    "evidence_annotation_id": 159923,
    "evidence_id": 174433,
    "evidence_wiki_url": "Mission-COLON-_Impossible_6",
    "evidence_sentence_id": -1
  },
  {
    "id": 143098,
    "label": "SUPPORTS",
    "claim": "Believe is a work.",
    "evidence_annotation_id": 339066,
    "evidence_id": 324103,
    "evidence_wiki_url": "Believe_-LRB-Cher_song-RRB-",
    "evidence_sentence_id": 17
  },
  {
    "id": 50660,
    "label": "SUPPORTS",
    "claim": "Russ is a rapper.",
    "evidence_annotation_id": 67024,
    "evidence_id": 77818,
    "evidence_wiki_url": "Losin_Control",
    "evidence_sentence_id": -1
  },
  {
    "id": 86144,
    "label": "REFUTES",
    "claim": "Eliza Dushka is incapable of having any roles in films.",
    "evidence_annotation_id": 103347,
    "evidence_id": 116746,
    "evidence_wiki_url": "Eliza_Dushku",
    "evidence_sentence_id": 2
  },
  {
    "id": 213128,
    "label": "REFUTES",
    "claim": "The Weeknd only released an album in 2011.",
    "evidence_annotation_id": 252804,
    "evidence_id": 252683,
    "evidence_wiki_url": "The_Weeknd",
    "evidence_sentence_id": 3
  },
  {
    "id": 77141,
    "label": "NOT ENOUGH INFO",
    "claim": "Michael J. Fox had a virus.",
    "evidence_annotation_id": 250237,
    "evidence_id": -1,
    "evidence_wiki_url": "",
    "evidence_sentence_id": -1
  },
  {
    "id": 177303,
    "label": "SUPPORTS",
    "claim": "Felicity Jones appeared in a 2014 British biographical romantic drama film.",
    "evidence_annotation_id": 205487,
    "evidence_id": 214066,
    "evidence_wiki_url": "Felicity_Jones",
    "evidence_sentence_id": 10
  },
  {
    "id": 50928,
    "label": "SUPPORTS",
    "claim": "Heinrich Himmler oversaw all internal and external police of Nazi Germany.",
    "evidence_annotation_id": 67260,
    "evidence_id": 78069,
    "evidence_wiki_url": "Heinrich_Himmler",
    "evidence_sentence_id": 10
  },
  {
    "id": 494,
    "label": "SUPPORTS",
    "claim": "Hotel Hell is a TV series.",
    "evidence_annotation_id": 15930,
    "evidence_id": 19808,
    "evidence_wiki_url": "Hotel_Hell",
    "evidence_sentence_id": 5
  },
  {
    "id": 6694,
    "label": "SUPPORTS",
    "claim": "The Catalyst is a single by Linkin Park.",
    "evidence_annotation_id": 247019,
    "evidence_id": 247378,
    "evidence_wiki_url": "The_Catalyst",
    "evidence_sentence_id": -1
  },
  {
    "id": 68174,
    "label": "SUPPORTS",
    "claim": "Wilt Chamberlain plays basketball.",
    "evidence_annotation_id": 84780,
    "evidence_id": 97002,
    "evidence_wiki_url": "Wilt_Chamberlain",
    "evidence_sentence_id": 1
  },
  {
    "id": 206499,
    "label": "SUPPORTS",
    "claim": "Warren Buffett developed an interest in investing in his youth.",
    "evidence_annotation_id": 246289,
    "evidence_id": 246832,
    "evidence_wiki_url": "Warren_Buffett",
    "evidence_sentence_id": 4
  },
  {
    "id": 41462,
    "label": "NOT ENOUGH INFO",
    "claim": "One Russian superhero is Black Widow.",
    "evidence_annotation_id": 57748,
    "evidence_id": -1,
    "evidence_wiki_url": "",
    "evidence_sentence_id": -1
  },
  {
    "id": 23051,
    "label": "SUPPORTS",
    "claim": "Argo has at least one producer.",
    "evidence_annotation_id": 305371,
    "evidence_id": 296202,
    "evidence_wiki_url": "Argo_-LRB-2012_film-RRB-",
    "evidence_sentence_id": 6
  },
  {
    "id": 217432,
    "label": "SUPPORTS",
    "claim": "Captain America: The Winter Soldier is a work.",
    "evidence_annotation_id": 258430,
    "evidence_id": 257220,
    "evidence_wiki_url": "Captain_America-COLON-_The_Winter_Soldier",
    "evidence_sentence_id": -1
  },
  {
    "id": 94287,
    "label": "SUPPORTS",
    "claim": "Rhona Mitra acts.",
    "evidence_annotation_id": 111710,
    "evidence_id": 125528,
    "evidence_wiki_url": "Rhona_Mitra",
    "evidence_sentence_id": 5
  },
  {
    "id": 102748,
    "label": "SUPPORTS",
    "claim": "Robert Redford was a guest star on a show.",
    "evidence_annotation_id": 120766,
    "evidence_id": 135036,
    "evidence_wiki_url": "Robert_Redford",
    "evidence_sentence_id": 4
  },
  {
    "id": 5443,
    "label": "SUPPORTS",
    "claim": "The Matrix stars Keanu Reeves as John Matrix.",
    "evidence_annotation_id": 22215,
    "evidence_id": 27337,
    "evidence_wiki_url": "The_Matrix",
    "evidence_sentence_id": -1
  },
  {
    "id": 60384,
    "label": "NOT ENOUGH INFO",
    "claim": "Roman Reigns is a three-time born again Christian.",
    "evidence_annotation_id": 189550,
    "evidence_id": -1,
    "evidence_wiki_url": "",
    "evidence_sentence_id": -1
  },
  {
    "id": 9341,
    "label": "SUPPORTS",
    "claim": "Alison Brie works as an actress.",
    "evidence_annotation_id": 24227,
    "evidence_id": 29954,
    "evidence_wiki_url": "Mad_Men",
    "evidence_sentence_id": 5
  }
]
