[
  {
    "selection": "Frank Sinatra's middle name was Albert.",
    "result": {
      "result": "correct",
      "explanation": "The text explicitly states that Frank Sinatra's middle name was Albert.",
      "article": {
        "url": "http://en.wikipedia.org/?curid=991143",
        "page_url": "http://en.wikipedia.org/?curid=991143",
        "section_url": "http://en.wikipedia.org/?curid=991143#Early_life",
        "title": "Frank Sinatra Jr.",
        "section": "Early life",
        "snippet": "Francis Wayne Sinatra was born on January 10, 1944, in Jersey City, New Jersey, into the household of one of the most popular singers in the world, Frank Sinatra. The younger Sinatra was technically not a \"junior\", as his father's middle name was Albert, but was nonetheless known as Frank Jr. throughout his life.",
        "references": 41,
        "contributors": 737,
        "last_updated": "2024-03-08 22:03"
      }
    },
    "error": null
  },
  {
    "selection": "Star Wars: The Force Awakens received only praise.",
    "result": {
      "result": "error",
      "explanation": "Something unexpected happened."
    },
    "error": null
  },
  {
    "selection": "Samuel L. Jackson was not in the M. Night Shyamalan film Unbreakable.",
    "result": {
      "result": "error",
      "explanation": "Something unexpected happened."
    },
    "error": null
  },
  {
    "selection": "George W. Bush was a president.",
    "result": {
      "result": "error",
      "explanation": "Something unexpected happened."
    },
    "error": null
  },
  {
    "selection": "FC Barcelona was formed in 1899.",
    "result": {
      "result": "error",
      "explanation": "Something unexpected happened."
    },
    "error": null
  },
  {
    "selection": "Snooki & Jwoww was renewed by MTV.",
    "result": {
      "result": "error",
      "explanation": "Something unexpected happened."
    },
    "error": null
  },
  {
    "selection": "Katie Holmes refused to ever become an actress.",
    "result": {
      "result": "error",
      "explanation": "Something unexpected happened."
    },
    "error": null
  },
  {
    "selection": "Alicia Silverstone was in an American film.",
    "result": {
      "result": "error",
      "explanation": "Something unexpected happened."
    },
    "error": null
  },
  {
    "selection": "Planet of the Apes' filming took place between May 21 and August 10, 1967.",
    "result": {
      "result": "error",
      "explanation": "Something unexpected happened."
    },
    "error": null
  },
  {
    "selection": "Gillian Anderson was born in Somalia to Somali parents.",
    "result": {
      "result": "error",
      "explanation": "Something unexpected happened."
    },
    "error": null
  },
  {
    "selection": "Red Hot Chili Peppers were originally named Tony Flow and the Miraculously Majestic Masters of Mayhem.",
    "result": {
      "result": "error",
      "explanation": "Something unexpected happened."
    },
    "error": null
  },
  {
    "selection": "Scarlett Johansson is an actress.",
    "result": {
      "result": "error",
      "explanation": "Something unexpected happened."
    },
    "error": null
  },
  {
    "selection": "Italy experienced economic growth between 1494 to 1559.",
    "result": {
      "result": "error",
      "explanation": "Something unexpected happened."
    },
    "error": null
  },
  {
    "selection": "Ronald Reagan was a president.",
    "result": {
      "result": "error",
      "explanation": "Something unexpected happened."
    },
    "error": null
  },
  {
    "selection": "Jacqueline Kennedy Onassis was famous.",
    "result": {
      "result": "error",
      "explanation": "Something unexpected happened."
    },
    "error": null
  },
  {
    "selection": "Inhumans is developed only for ABC.",
    "result": {
      "result": "incorrect",
      "explanation": "The series 'Inhumans' is developed in conjunction with ABC Studios and IMAX serves as a financing partner, marking the first time it had done so for a television series.",
      "article": {
        "url": "http://en.wikipedia.org/?curid=52281037",
        "page_url": "http://en.wikipedia.org/?curid=52281037",
        "section_url": "http://en.wikipedia.org/?curid=52281037#Development",
        "title": "Inhumans (TV series)",
        "section": "Development",
        "snippet": "IMAX serves as a financing partner on the series, the first time it had done so for a television series",
        "references": 280,
        "contributors": 395,
        "last_updated": "2024-03-05 23:34"
      }
    },
    "error": null
  },
  {
    "selection": "Pixar uses CGI animation to create films.",
    "result": {
      "result": "correct",
      "explanation": "The statement is directly supported by the text, which mentions that Pixar Animation Studios uses CGI to create films.",
      "article": {
        "url": "http://en.wikipedia.org/?curid=16885554",
        "page_url": "http://en.wikipedia.org/?curid=16885554",
        "section_url": "http://en.wikipedia.org/?curid=16885554#Lead_Section",
        "title": "List of Pixar films",
        "section": "Lead Section",
        "snippet": "Pixar Animation Studios is an American computer-generated imagery|CGI film production company based in Emeryville, California, United States.",
        "references": 273,
        "contributors": 4333,
        "last_updated": "2024-03-13 00:02"
      }
    },
    "error": null
  },
  {
    "selection": "Laurence Olivier received American film awards.",
    "result": {
      "result": "correct",
      "explanation": "The quote mentions Laurence Olivier receiving an Academy Honorary Award for his work in film.",
      "article": {
        "url": "http://en.wikipedia.org/?curid=6210824",
        "page_url": "http://en.wikipedia.org/?curid=6210824",
        "section_url": "http://en.wikipedia.org/?curid=6210824#Film",
        "title": "List of awards and nominations received by Laurence Olivier",
        "section": "Film",
        "snippet": "Laurence Olivier for his outstanding achievement as actor, producer and director in bringing ''Henry V'' to the screen",
        "references": 60,
        "contributors": 114,
        "last_updated": "2023-10-16 07:22"
      }
    },
    "error": null
  },
  {
    "selection": "Bill Clinton was never acquitted by the U.S. Senate.",
    "result": {
      "result": "correct",
      "explanation": "The text explicitly states that Bill Clinton was acquitted by the U.S. Senate.",
      "article": {
        "url": "http://en.wikipedia.org/?curid=3356",
        "page_url": "http://en.wikipedia.org/?curid=3356",
        "section_url": "http://en.wikipedia.org/?curid=3356#Impeachment_and_acquittal",
        "title": "Bill Clinton",
        "section": "Impeachment and acquittal",
        "snippet": "The Senate later acquitted Clinton of both charges.",
        "references": 614,
        "contributors": 6533,
        "last_updated": "2024-03-14 02:02"
      }
    },
    "error": null
  },
  {
    "selection": "A Nightmare on Elm Street stars Katie Cassidy and Rooney Mara.",
    "result": {
      "result": "correct",
      "explanation": "The statement is directly supported by the text passages.",
      "article": {
        "url": "http://en.wikipedia.org/?curid=23286957",
        "page_url": "http://en.wikipedia.org/?curid=23286957",
        "section_url": "http://en.wikipedia.org/?curid=23286957#Cast",
        "title": "A Nightmare on Elm Street (2010 film)",
        "section": "Cast",
        "snippet": "* Katie Cassidy as Tina Gray (A Nightmare on Elm Street)#Kris Fowles|Kris Fowles\n** Julianna Damm as young Kris\n* Thomas Dekker (actor)|Thomas Dekker as Jesse Braun\n** Bayden Coyer as young",
        "references": 163,
        "contributors": 1059,
        "last_updated": "2024-02-16 19:55"
      }
    },
    "error": null
  },
  {
    "selection": "Paradise is an EP.",
    "result": {
      "result": "correct",
      "explanation": "The quote directly states that 'Paradise' is an EP.",
      "article": {
        "url": "http://en.wikipedia.org/?curid=37179919",
        "page_url": "http://en.wikipedia.org/?curid=37179919",
        "section_url": "http://en.wikipedia.org/?curid=37179919#Lead_Section",
        "title": "Paradise (Lana Del Rey EP)",
        "section": "Lead Section",
        "snippet": "'Paradise''''' is the third Extended Play|EP by American singer-songwriter Lana Del Re",
        "references": 96,
        "contributors": 432,
        "last_updated": "2024-03-13 17:02"
      }
    },
    "error": null
  },
  {
    "selection": "Denial premiered at the Toronto International Film Festival in 1997.",
    "result": {
      "result": "incorrect",
      "explanation": "The statement is contradicted by the information that the Toronto International Film Festival in question took place in 2016, not 1997.",
      "article": {
        "url": "http://en.wikipedia.org/?curid=49394691",
        "page_url": "http://en.wikipedia.org/?curid=49394691",
        "section_url": "http://en.wikipedia.org/?curid=49394691#Lead_Section",
        "title": "2016 Toronto International Film Festival",
        "section": "Lead Section",
        "snippet": "The 41st annual Toronto International Film Festival was held from 8 to 18 September 2016.",
        "references": 20,
        "contributors": 82,
        "last_updated": "2024-03-13 19:51"
      }
    },
    "error": null
  },
  {
    "selection": "Cyndi Lauper released a debut solo album.",
    "result": {
      "result": "correct",
      "explanation": "The quote directly states that Cyndi Lauper released her debut solo album.",
      "article": {
        "url": "http://en.wikipedia.org/?curid=5661336",
        "page_url": "http://en.wikipedia.org/?curid=5661336",
        "section_url": "http://en.wikipedia.org/?curid=5661336#Lead_Section",
        "title": "Cyndi Lauper discography",
        "section": "Lead Section",
        "snippet": "Lauper obtained a contract with Portrait Records, and her debut solo album, ''She's So Unusual'', was released.",
        "references": 138,
        "contributors": 466,
        "last_updated": "2024-02-27 15:23"
      }
    },
    "error": null
  },
  {
    "selection": "The Coen brothers have only directed Barton Fink.",
    "result": {
      "result": "correct",
      "explanation": "The quote clearly states that the Coen brothers directed Barton Fink.",
      "article": {
        "url": "http://en.wikipedia.org/?curid=320401",
        "page_url": "http://en.wikipedia.org/?curid=320401",
        "section_url": "http://en.wikipedia.org/?curid=320401#Lead_Section",
        "title": "Barton Fink",
        "section": "Lead Section",
        "snippet": "''Barton Fink''''' is a 1991 American historical drama|period black comedy psychological thriller film written, produced, edited and directed by the Coen brothers",
        "references": 72,
        "contributors": 635,
        "last_updated": "2024-03-14 03:27"
      }
    },
    "error": null
  },
  {
    "selection": "Frank Zappa's debut album was released in 1966.",
    "result": {
      "result": "correct",
      "explanation": "The quote directly states that the album 'Freak Out!' was released in 1966.",
      "article": {
        "url": "http://en.wikipedia.org/?curid=1485905",
        "page_url": "http://en.wikipedia.org/?curid=1485905",
        "section_url": "http://en.wikipedia.org/?curid=1485905#Debut_album:_<i>Freak_Out!</i>_(1966)",
        "title": "The Mothers of Invention",
        "section": "Debut album: <i>Freak Out!</i> (1966)",
        "snippet": "With Wilson credited as producer, the Mothers of Invention, augmented by a studio orchestra, recorded the groundbreaking ''Freak Out!'' (1966) which, preceded by Bob Dylan's ''Blonde on Blonde'', was the second rock double album of new material ever released.",
        "references": 46,
        "contributors": 401,
        "last_updated": "2024-03-12 20:50"
      }
    },
    "error": null
  },
  {
    "selection": "Hungary was only founded by Barack Obama.",
    "result": {
      "result": "incorrect",
      "explanation": "The statement is incorrect as Barack Obama did not found Hungary, he was the 44th president of the United States from 2009 to 2017.",
      "article": {
        "url": "http://en.wikipedia.org/?curid=23135988",
        "page_url": "http://en.wikipedia.org/?curid=23135988",
        "section_url": "http://en.wikipedia.org/?curid=23135988#Lead_Section",
        "title": "List of international presidential trips made by Barack Obama",
        "section": "Lead Section",
        "snippet": "Barack Obama made 52 international trips to 58 countries (in addition to visiting the West Bank) during Presidency of Barack Obama|his presidency, which began on First inauguration o",
        "references": 322,
        "contributors": 438,
        "last_updated": "2023-12-19 02:26"
      }
    },
    "error": null
  },
  {
    "selection": "Blackhat stars an actor.",
    "result": {
      "result": "correct",
      "explanation": "The statement is directly supported by the text, which mentions that Blackhat stars Chris Hemsworth.",
      "article": {
        "url": "http://en.wikipedia.org/?curid=39384134",
        "page_url": "http://en.wikipedia.org/?curid=39384134",
        "section_url": "http://en.wikipedia.org/?curid=39384134#Lead_Section",
        "title": "Blackhat (film)",
        "section": "Lead Section",
        "snippet": "'''''Blackhat''''' is a 2015 American action thriller film produced and directed by Michael Mann and starring Chris Hemsworth, Tang Wei, Viola Davis, and Wang Leehom.",
        "references": 78,
        "contributors": 431,
        "last_updated": "2024-02-27 22:29"
      }
    },
    "error": null
  },
  {
    "selection": "The Houston Rockets have won four Western Conference titles.",
    "result": {
      "result": "incorrect",
      "explanation": "The text does not mention the Houston Rockets winning four Western Conference titles.",
      "article": {
        "url": "http://en.wikipedia.org/?curid=72885",
        "page_url": "http://en.wikipedia.org/?curid=72885",
        "section_url": "http://en.wikipedia.org/?curid=72885#Franchise_history",
        "title": "Houston Rockets",
        "section": "Franchise history",
        "snippet": "The Rockets found themselves yet again another disappointing season with a 22\u201360 record tying with the San Antonio Spurs in the Western Conference.",
        "references": 314,
        "contributors": 2495,
        "last_updated": "2024-03-08 00:06"
      }
    },
    "error": null
  },
  {
    "selection": "United Kingdom is a developed country.",
    "result": {
      "result": "correct",
      "explanation": "The statement is directly supported by the text, which identifies the United Kingdom as the first industrialized country.",
      "article": {
        "url": "http://en.wikipedia.org/?curid=78255",
        "page_url": "http://en.wikipedia.org/?curid=78255",
        "section_url": "http://en.wikipedia.org/?curid=78255#Definition_and_criteria",
        "title": "Developed country",
        "section": "Definition and criteria",
        "snippet": "The first industrialized country was the United Kingdom, followed by Belgium.",
        "references": 96,
        "contributors": 2905,
        "last_updated": "2024-03-13 06:57"
      }
    },
    "error": null
  },
  {
    "selection": "Margot Kidder won an award in the 2010s.",
    "result": {
      "result": "incorrect",
      "explanation": "The text mentions that Margot Kidder won the award twice, but does not specify that one of the wins was in the 2010s.",
      "article": {
        "url": "http://en.wikipedia.org/?curid=484842",
        "page_url": "http://en.wikipedia.org/?curid=484842",
        "section_url": "http://en.wikipedia.org/?curid=484842#Lead_Section",
        "title": "Saturn Award for Best Actress",
        "section": "Lead Section",
        "snippet": "The actresses with the most nominations are Jamie Lee Curtis, Jodie Foster, Natalie Portman, Naomi Watts and Sigourney Weaver, who are all tied with five. Curtis, Foster, Portman, Watts and Sandra Bullock are the only actresses to have won it twice.",
        "references": 3,
        "contributors": 159,
        "last_updated": "2024-02-12 23:12"
      }
    },
    "error": null
  },
  {
    "selection": "Syria includes Jewish people.",
    "result": {
      "result": "correct",
      "explanation": "The statement is supported by the text, which mentions the presence of Jews in Syria since ancient times.",
      "article": {
        "url": "http://en.wikipedia.org/?curid=5531820",
        "page_url": "http://en.wikipedia.org/?curid=5531820",
        "section_url": "http://en.wikipedia.org/?curid=5531820#History",
        "title": "Syrian Jews",
        "section": "History",
        "snippet": "There have been Jews in Syria since ancient times: according to the community's tradition, since the time of King David, and certainly since early Roman times.",
        "references": 42,
        "contributors": 899,
        "last_updated": "2024-02-23 19:17"
      }
    },
    "error": null
  },
  {
    "selection": "Serena Williams competes in women's singles and doubles.",
    "result": {
      "result": "incorrect",
      "explanation": "The provided text only mentions Serena Williams' participation in women's singles, not doubles.",
      "article": {
        "url": "http://en.wikipedia.org/?curid=578943",
        "page_url": "http://en.wikipedia.org/?curid=578943",
        "section_url": "http://en.wikipedia.org/?curid=578943#Women's_doubles",
        "title": "Williams sisters",
        "section": "Women's doubles",
        "snippet": "Note: Serena Williams did not play at the 2004 Olympics because of injury. Venus partnered with American Chanda Rubin and lost in the first round to eventual gold-medalists Sun Tiantian and Li Ting (tennis, born 1980)|Li Ting.",
        "references": 12,
        "contributors": 341,
        "last_updated": "2024-02-25 05:01"
      }
    },
    "error": null
  },
  {
    "selection": "Muhammad is significant to religion.",
    "result": {
      "result": "correct",
      "explanation": "The quote highlights Muhammad's significance in Islam as the Seal of the Prophets and the basis for Islamic religious belief.",
      "article": {
        "url": "http://en.wikipedia.org/?curid=18934",
        "page_url": "http://en.wikipedia.org/?curid=18934",
        "section_url": "http://en.wikipedia.org/?curid=18934#Lead_Section",
        "title": "Muhammad",
        "section": "Lead Section",
        "snippet": "is believed to be the Seal of the Prophets within Islam, with the Quran as well as his Hadith|teachings and Sunnah|practices forming the basis for Islamic religious bel",
        "references": 218,
        "contributors": 4983,
        "last_updated": "2024-03-12 08:04"
      }
    },
    "error": null
  },
  {
    "selection": "Leonardo da Vinci is a painter.",
    "result": {
      "result": "correct",
      "explanation": "The statement is directly supported by the text, which identifies Leonardo da Vinci as one of the greatest painters in history.",
      "article": {
        "url": "http://en.wikipedia.org/?curid=18079",
        "page_url": "http://en.wikipedia.org/?curid=18079",
        "section_url": "http://en.wikipedia.org/?curid=18079#Lead_Section",
        "title": "Leonardo da Vinci",
        "section": "Lead Section",
        "snippet": "Leonardo is identified as one of the greatest painters in the history of art and is often credited as the founder of the High Renaissance.",
        "references": 201,
        "contributors": 4002,
        "last_updated": "2024-03-05 17:53"
      }
    },
    "error": null
  },
  {
    "selection": "Laura Linney was in a movie.",
    "result": {
      "result": "no_result",
      "explanation": "No matching citations found."
    },
    "error": null
  },
  {
    "selection": "Alicia Silverstone appeared in a music video.",
    "result": {
      "result": "correct",
      "explanation": "The statement is directly supported by the text passage.",
      "article": {
        "url": "http://en.wikipedia.org/?curid=69930",
        "page_url": "http://en.wikipedia.org/?curid=69930",
        "section_url": "http://en.wikipedia.org/?curid=69930#Filmography",
        "title": "Alicia Silverstone",
        "section": "Filmography",
        "snippet": "1994\n| \"Crazy (Aerosmith song)#Music video|Crazy\"\n| Girl #1",
        "references": 190,
        "contributors": 1657,
        "last_updated": "2024-03-11 21:51"
      }
    },
    "error": null
  },
  {
    "selection": "Dylan O'Brien is not a film actor.",
    "result": {
      "result": "incorrect",
      "explanation": "The statement is contradicted by the fact that Dylan O'Brien is indeed a film actor.",
      "article": {
        "url": "http://en.wikipedia.org/?curid=32010836",
        "page_url": "http://en.wikipedia.org/?curid=32010836",
        "section_url": "http://en.wikipedia.org/?curid=32010836#Career",
        "title": "Dylan O'Brien",
        "section": "Career",
        "snippet": "Before beginning his acting career, O'Brien produced, directed and starred in a number of short comedy films which he released through his personal YouTube channel.",
        "references": 91,
        "contributors": 1214,
        "last_updated": "2024-03-07 20:14"
      }
    },
    "error": null
  },
  {
    "selection": "Adele has an album called 25.",
    "result": {
      "result": "correct",
      "explanation": "The statement is directly supported by the text.",
      "article": {
        "url": "http://en.wikipedia.org/?curid=44878113",
        "page_url": "http://en.wikipedia.org/?curid=44878113",
        "section_url": "http://en.wikipedia.org/?curid=44878113#Lead_Section",
        "title": "25 (Adele album)",
        "section": "Lead Section",
        "snippet": "''' is the third studio album by the English singer-songwriter Adele, released on 20 November 2015 by XL Recordings and Columbia Records.",
        "references": 501,
        "contributors": 1196,
        "last_updated": "2024-03-11 22:04"
      }
    },
    "error": null
  },
  {
    "selection": "Audrey Hepburn starred in a movie.",
    "result": {
      "result": "partially_correct",
      "explanation": "The statement is partially supported as it mentions Audrey Hepburn, but does not specifically mention her starring in a movie.",
      "article": {
        "url": "http://en.wikipedia.org/?curid=52139",
        "page_url": "http://en.wikipedia.org/?curid=52139",
        "section_url": "http://en.wikipedia.org/?curid=52139#Filmography_and_stage_roles",
        "title": "Audrey Hepburn",
        "section": "Filmography and stage roles",
        "snippet": "Hepburn was considered by some to be one of the most beautiful women of all time.",
        "references": 356,
        "contributors": 3779,
        "last_updated": "2024-03-09 19:07"
      }
    },
    "error": null
  },
  {
    "selection": "Asia contains places.",
    "result": {
      "result": "correct",
      "explanation": "The quote supports the statement that Asia contains places by mentioning the variation across regions in terms of ethnic groups, cultures, environments, and more.",
      "article": {
        "url": "http://en.wikipedia.org/?curid=689",
        "page_url": "http://en.wikipedia.org/?curid=689",
        "section_url": "http://en.wikipedia.org/?curid=689#Lead_Section",
        "title": "Asia",
        "section": "Lead Section",
        "snippet": "Asia varies greatly across and within Regions of Asia|its regions with regard to ethnic groups, cultures, environments, economics, historical ties and gover",
        "references": 236,
        "contributors": 3866,
        "last_updated": "2024-03-07 21:34"
      }
    },
    "error": null
  },
  {
    "selection": "Edge of Tomorrow was released in Portugal.",
    "result": {
      "result": "incorrect",
      "explanation": "The statement is contradicted by the text, which states that 'Remind Me Tomorrow' was released on January 18, 2019, not in Portugal.",
      "article": {
        "url": "http://en.wikipedia.org/?curid=58900144",
        "page_url": "http://en.wikipedia.org/?curid=58900144",
        "section_url": "http://en.wikipedia.org/?curid=58900144#Lead_Section",
        "title": "Remind Me Tomorrow",
        "section": "Lead Section",
        "snippet": "'''''Remind Me Tomorrow''''' is the fifth studio album by the American singer-songwriter Sharon Van Etten. It was released on January 18, 2019&nbsp;on Jagjaguwar.",
        "references": 60,
        "contributors": 42,
        "last_updated": "2023-11-06 07:53"
      }
    },
    "error": null
  },
  {
    "selection": "Her was given a wide release on January 10, 2014.",
    "result": {
      "result": "incorrect",
      "explanation": "The film 'Her' was released on Blu-ray Disc and DVD on March 4, 2014, not given a wide release on January 10, 2014.",
      "article": {
        "url": "http://en.wikipedia.org/?curid=36885907",
        "page_url": "http://en.wikipedia.org/?curid=36885907",
        "section_url": "http://en.wikipedia.org/?curid=36885907#Release",
        "title": "Her (film)",
        "section": "Release",
        "snippet": "''Her'' was released by Warner Home Video on Blu-ray Disc and DVD on March 4, 2014.",
        "references": 153,
        "contributors": 792,
        "last_updated": "2024-03-10 02:20"
      }
    },
    "error": null
  },
  {
    "selection": "Sally Field was an actress.",
    "result": {
      "result": "correct",
      "explanation": "The statement is directly supported by the text, which clearly states that Sally Field is an American actress.",
      "article": {
        "url": "http://en.wikipedia.org/?curid=240361",
        "page_url": "http://en.wikipedia.org/?curid=240361",
        "section_url": "http://en.wikipedia.org/?curid=240361#Lead_Section",
        "title": "Sally Field",
        "section": "Lead Section",
        "snippet": "Sally Margaret Field''' (born November 6, 1946) is an American actress",
        "references": 147,
        "contributors": 1425,
        "last_updated": "2024-03-13 23:41"
      }
    },
    "error": null
  },
  {
    "selection": "Poppy is a Tennessean.",
    "result": {
      "result": "correct",
      "explanation": "The statement is directly supported by the text passage.",
      "article": {
        "url": "http://en.wikipedia.org/?curid=636562",
        "page_url": "http://en.wikipedia.org/?curid=636562",
        "section_url": "http://en.wikipedia.org/?curid=636562#Lead_Section",
        "title": "Bridgestone Arena",
        "section": "Lead Section",
        "snippet": "rpose indoor arena in downtown Nashville, Tennessee, United States.",
        "references": 41,
        "contributors": 481,
        "last_updated": "2024-02-26 02:57"
      }
    },
    "error": null
  },
  {
    "selection": "Moana is a 2016 novel.",
    "result": {
      "result": "incorrect",
      "explanation": "The provided text only mentions the film 'Zootopia', not the novel 'Moana'.",
      "article": {
        "url": "http://en.wikipedia.org/?curid=42089078",
        "page_url": "http://en.wikipedia.org/?curid=42089078",
        "section_url": "http://en.wikipedia.org/?curid=42089078#Lead_Section",
        "title": "Zootopia",
        "section": "Lead Section",
        "snippet": "Zootopia'' premiered at the Brussels Animation Film Festival in Belgium on February 13, 2016",
        "references": 379,
        "contributors": 2137,
        "last_updated": "2024-03-11 23:57"
      }
    },
    "error": null
  },
  {
    "selection": "Just My Luck (2006 film) features Chris Pine in a lead role.",
    "result": {
      "result": "correct",
      "explanation": "The statement is directly supported by the text.",
      "article": {
        "url": "http://en.wikipedia.org/?curid=1663320",
        "page_url": "http://en.wikipedia.org/?curid=1663320",
        "section_url": "http://en.wikipedia.org/?curid=1663320#Lead_Section",
        "title": "Just My Luck (2006 film)",
        "section": "Lead Section",
        "snippet": "'''''Just My Luck''''' is a 2006 American romantic comedy film directed by Donald Petrie, from a screenplay by I. Marlene King and Amy B. Harris, starring Lindsay Lohan, Chris Pine, Faizon Love, Missi Pyle, and McFly.",
        "references": 16,
        "contributors": 490,
        "last_updated": "2024-03-10 00:33"
      }
    },
    "error": null
  },
  {
    "selection": "Maria Sharapova tested positive for a substance that has been banned by the president.",
    "result": {
      "result": "correct",
      "explanation": "The quote directly states that the substance was banned by the International Tennis Federation.",
      "article": {
        "url": "http://en.wikipedia.org/?curid=58397322",
        "page_url": "http://en.wikipedia.org/?curid=58397322",
        "section_url": "http://en.wikipedia.org/?curid=58397322#Doping_in_women's_tennis",
        "title": "Doping in tennis",
        "section": "Doping in women's tennis",
        "snippet": "On 1 January 2016, the drug was placed on the International Tennis Federation's banned substance list as it was ruled to have performance-enhancing effects.",
        "references": 57,
        "contributors": 34,
        "last_updated": "2024-03-03 16:29"
      }
    },
    "error": null
  },
  {
    "selection": "Justin Bieber released at least four studio albums.",
    "result": {
      "result": "correct",
      "explanation": "The text explicitly states that 'Purpose' is Justin Bieber's fourth studio album.",
      "article": {
        "url": "http://en.wikipedia.org/?curid=48269271",
        "page_url": "http://en.wikipedia.org/?curid=48269271",
        "section_url": "http://en.wikipedia.org/?curid=48269271#Lead_Section",
        "title": "Purpose (Justin Bieber album)",
        "section": "Lead Section",
        "snippet": "'Purpose''''' is the fourth studio album by Canadian singer Justin Biebe",
        "references": 515,
        "contributors": 1067,
        "last_updated": "2024-02-23 15:28"
      }
    },
    "error": null
  },
  {
    "selection": "Miyu Irino is a Voice contestant.",
    "result": {
      "result": "error",
      "explanation": "Something unexpected happened."
    },
    "error": null
  },
  {
    "selection": "100 Greatest of All Time first premiered on the Tennis Channel.",
    "result": {
      "result": "correct",
      "explanation": "The statement is directly supported by the text passage which mentions that the series was first aired by the Tennis Channel.",
      "article": {
        "url": "http://en.wikipedia.org/?curid=35191146",
        "page_url": "http://en.wikipedia.org/?curid=35191146",
        "section_url": "http://en.wikipedia.org/?curid=35191146#Lead_Section",
        "title": "100 Greatest of All Time",
        "section": "Lead Section",
        "snippet": "'100 Greatest of All Time''''' was a sports television series of five one-hour episodes, produced and first aired by the Tennis Channel in March 201",
        "references": 2,
        "contributors": 429,
        "last_updated": "2024-02-04 16:17"
      }
    },
    "error": null
  },
  {
    "selection": "Chris O'Dowd has starred only in films.",
    "result": {
      "result": "incorrect",
      "explanation": "The provided text passages mention that Chris O'Dowd has starred in both films and TV series such as 'The IT Crowd'.",
      "article": {
        "url": "http://en.wikipedia.org/?curid=4218115",
        "page_url": "http://en.wikipedia.org/?curid=4218115",
        "section_url": "http://en.wikipedia.org/?curid=4218115#Filmography",
        "title": "Chris O'Dowd",
        "section": "Filmography",
        "snippet": "The IT Crowd",
        "references": 59,
        "contributors": 847,
        "last_updated": "2024-03-07 18:27"
      }
    },
    "error": null
  },
  {
    "selection": "Jonathan Hensleigh directed Jumanji.",
    "result": {
      "result": "incorrect",
      "explanation": "The provided text does not mention Jonathan Hensleigh as the director of Jumanji. The actual director of Jumanji is Joe Johnston.",
      "article": {
        "url": "http://en.wikipedia.org/?curid=3700174",
        "page_url": "http://en.wikipedia.org/?curid=3700174",
        "section_url": "http://en.wikipedia.org/?curid=3700174#Lead_Section",
        "title": "Jumanji",
        "section": "Lead Section",
        "snippet": "|\n* Jonathan Hensleigh\n* Greg Tay",
        "references": 77,
        "contributors": 2532,
        "last_updated": "2024-03-10 06:28"
      }
    },
    "error": null
  },
  {
    "selection": "Dwayne Johnson was born in 1972.",
    "result": {
      "result": "correct",
      "explanation": "The statement is directly supported by the text passage which states that Dwayne Johnson was born in 1972 in Hayward, California.",
      "article": {
        "url": "http://en.wikipedia.org/?curid=156126",
        "page_url": "http://en.wikipedia.org/?curid=156126",
        "section_url": "http://en.wikipedia.org/?curid=156126#Early_life",
        "title": "Dwayne Johnson",
        "section": "Early life",
        "snippet": "Johnson was born in Hayward, California, and attended Richmond Road Primary School before returning to the U.S.",
        "references": 613,
        "contributors": 7246,
        "last_updated": "2024-03-13 19:28"
      }
    },
    "error": null
  },
  {
    "selection": "Stanley Kubrick is not a director.",
    "result": {
      "result": "incorrect",
      "explanation": "The text clearly states that Stanley Kubrick was a director, known for his meticulous attention to detail and innovative filmmaking techniques.",
      "article": {
        "url": "http://en.wikipedia.org/?curid=26683",
        "page_url": "http://en.wikipedia.org/?curid=26683",
        "section_url": "http://en.wikipedia.org/?curid=26683#Directing_techniques",
        "title": "Stanley Kubrick",
        "section": "Directing techniques",
        "snippet": "Kubrick's films typically involve expressions of an inner struggle, examined from different perspectives.",
        "references": 267,
        "contributors": 3370,
        "last_updated": "2024-03-12 09:45"
      }
    },
    "error": null
  },
  {
    "selection": "Faith Evans is a person.",
    "result": {
      "result": "correct",
      "explanation": "The statement is directly supported by the text, which introduces Faith Evans as an American contemporary R&B singer, songwriter, and actress.",
      "article": {
        "url": "http://en.wikipedia.org/?curid=368204",
        "page_url": "http://en.wikipedia.org/?curid=368204",
        "section_url": "http://en.wikipedia.org/?curid=368204#Lead_Section",
        "title": "Faith Evans",
        "section": "Lead Section",
        "snippet": "Faith Ren\u00e9e Evans''' (born June 10, 1973) is an American contemporary R&B|R&B singer, songwriter and act",
        "references": 107,
        "contributors": 1452,
        "last_updated": "2024-03-13 06:19"
      }
    },
    "error": null
  },
  {
    "selection": "There was a musician in the Grand Ole Pry.",
    "result": {
      "result": "error",
      "explanation": "Something unexpected happened."
    },
    "error": null
  },
  {
    "selection": "Islam does not have any followers.",
    "result": {
      "result": "incorrect",
      "explanation": "The statement is contradicted by the fact that there are about 1.9 billion Muslims globally.",
      "article": {
        "url": "http://en.wikipedia.org/?curid=6037917",
        "page_url": "http://en.wikipedia.org/?curid=6037917",
        "section_url": "http://en.wikipedia.org/?curid=6037917#Demographics",
        "title": "Islam",
        "section": "Demographics",
        "snippet": "As of 2020, about 24% of the global population, or about 1.9&nbsp;billion people, are Musli",
        "references": 544,
        "contributors": 5850,
        "last_updated": "2024-03-14 18:10"
      }
    },
    "error": null
  },
  {
    "selection": "The United Kingdom is the 21st-most populous city.",
    "result": {
      "result": "no_result",
      "explanation": "No matching citations found."
    },
    "error": null
  },
  {
    "selection": "Michael Jordan never played basketball.",
    "result": {
      "result": "no_result",
      "explanation": "No matching citations found."
    },
    "error": null
  },
  {
    "selection": "The capital city of Austria is Vienna.",
    "result": {
      "result": "correct",
      "explanation": "The statement is directly supported by the text, which clearly states that Vienna is the capital city of Austria.",
      "article": {
        "url": "http://en.wikipedia.org/?curid=55866",
        "page_url": "http://en.wikipedia.org/?curid=55866",
        "section_url": "http://en.wikipedia.org/?curid=55866#Lead_Section",
        "title": "Vienna",
        "section": "Lead Section",
        "snippet": "Vienna is completely surrounded by Lower Austria, and lies around 50 km (31 mi) west of Slovakia and its capital Bratislava, 60 km (37 mi) northwest of Hungary, and 60 km (37 mi) south of Moravia (Czech Republic).",
        "references": 312,
        "contributors": 3094,
        "last_updated": "2024-03-13 04:28"
      }
    },
    "error": null
  },
  {
    "selection": "The Miami Marlins are a team that plays baseball.",
    "result": {
      "result": "correct",
      "explanation": "The statement is directly supported by the text, which clearly states that the Miami Marlins are a professional baseball team.",
      "article": {
        "url": "http://en.wikipedia.org/?curid=11278",
        "page_url": "http://en.wikipedia.org/?curid=11278",
        "section_url": "http://en.wikipedia.org/?curid=11278#Lead_Section",
        "title": "Miami Marlins",
        "section": "Lead Section",
        "snippet": "Miami Marlins''' are an American professional baseball team based in Miami.",
        "references": 73,
        "contributors": 1993,
        "last_updated": "2024-03-12 23:43"
      }
    },
    "error": null
  },
  {
    "selection": "Birth of the Dragon comes out in summer 2017.",
    "result": {
      "result": "incorrect",
      "explanation": "The film 'Birth of the Dragon' was released in 2016, not in summer 2017.",
      "article": {
        "url": "http://en.wikipedia.org/?curid=47830506",
        "page_url": "http://en.wikipedia.org/?curid=47830506",
        "section_url": "http://en.wikipedia.org/?curid=47830506#Lead_Section",
        "title": "Birth of the Dragon",
        "section": "Lead Section",
        "snippet": "'''' is a 2016 American Martial arts film|martial arts action film directed by George Nolfi and written by Christopher Wilkinson and Stephen J. Riv",
        "references": 26,
        "contributors": 117,
        "last_updated": "2024-02-28 19:02"
      }
    },
    "error": null
  },
  {
    "selection": "Emily Ratajkowski was in a commercial for an upscale car brand during a Super Bowl.",
    "result": {
      "result": "correct",
      "explanation": "The statement is supported by the text passage.",
      "article": {
        "url": "http://en.wikipedia.org/?curid=26579594",
        "page_url": "http://en.wikipedia.org/?curid=26579594",
        "section_url": "http://en.wikipedia.org/?curid=26579594#Career",
        "title": "Emily Ratajkowski",
        "section": "Career",
        "snippet": "A Buick Super Bowl ad for its Buick Cascada|Cascada convertible during Super Bowl 50 on February 7, 2016, featured Ratajkowski and Odell Beckham Jr.",
        "references": 578,
        "contributors": 1295,
        "last_updated": "2024-03-09 00:33"
      }
    },
    "error": null
  },
  {
    "selection": "Judi Dench is an actress.",
    "result": {
      "result": "correct",
      "explanation": "The statement is directly supported by the text, which highlights Judi Dench's successful acting career and numerous awards.",
      "article": {
        "url": "http://en.wikipedia.org/?curid=85432",
        "page_url": "http://en.wikipedia.org/?curid=85432",
        "section_url": "http://en.wikipedia.org/?curid=85432#Lead_Section",
        "title": "Judi Dench",
        "section": "Lead Section",
        "snippet": "Dench has garnered List of awards and nominations received by Judi Dench|various accolades throughout a career spanning over six decades, including an Academy Award, a Tony Award, two Golden Globe Awards, four British Academy Television Awards, six B",
        "references": 270,
        "contributors": 1966,
        "last_updated": "2024-03-12 07:08"
      }
    },
    "error": null
  },
  {
    "selection": "Liv Tyler performed in a television series.",
    "result": {
      "result": "correct",
      "explanation": "The statement is directly supported by the text passage.",
      "article": {
        "url": "http://en.wikipedia.org/?curid=63632006",
        "page_url": "http://en.wikipedia.org/?curid=63632006",
        "section_url": "http://en.wikipedia.org/?curid=63632006#Lead_Section",
        "title": "List of Liv Tyler performances",
        "section": "Lead Section",
        "snippet": "Between 2014 and 2017, Tyler made her television acting debut with a main role on the supernatural drama series ''The Leftovers (TV series)|The Leftovers''.",
        "references": 73,
        "contributors": 26,
        "last_updated": "2023-11-10 18:24"
      }
    },
    "error": null
  },
  {
    "selection": "Lil Wayne has kept his albums entirely to himself.",
    "result": {
      "result": "incorrect",
      "explanation": "The text mentions collaborations with other artists like Birdman and 2 Chainz, indicating that Lil Wayne has not kept his albums entirely to himself.",
      "article": {
        "url": "http://en.wikipedia.org/?curid=168540",
        "page_url": "http://en.wikipedia.org/?curid=168540",
        "section_url": "http://en.wikipedia.org/?curid=168540#Lawsuits",
        "title": "Lil Wayne",
        "section": "Lawsuits",
        "snippet": "In February 2009, production company RMF Productions filed a $1.3&nbsp;million lawsuit against Carter following a $100,000 advance payment for three shows, all of which were cancelled by the artist.",
        "references": 410,
        "contributors": 3775,
        "last_updated": "2024-03-12 06:41"
      }
    },
    "error": null
  },
  {
    "selection": "The Wachowskis wrote The Matrix.",
    "result": {
      "result": "correct",
      "explanation": "The passage clearly states that the Wachowskis presented the script for 'The Matrix' to Warner Bros. Pictures.",
      "article": {
        "url": "http://en.wikipedia.org/?curid=30007",
        "page_url": "http://en.wikipedia.org/?curid=30007",
        "section_url": "http://en.wikipedia.org/?curid=30007#Production",
        "title": "The Matrix",
        "section": "Production",
        "snippet": "In 1994, the Wachowskis presented the script for the film ''Assassins (1995 film)|Assassins'' to Warner Bros. Pictures. After Lorenzo di Bonaventura, the president of production of the company at the time, read the script, he decided to buy rights to it and included two more pictures, ''Bound (1996 film)|Bound'' and ''The Matrix'', in the contract. The first movie the Wachowskis directed, ''Bound'', then became a critical success. Using this mome",
        "references": 349,
        "contributors": 5029,
        "last_updated": "2024-03-11 16:53"
      }
    },
    "error": null
  },
  {
    "selection": "Sleeping Beauty premiered in May 2011.",
    "result": {
      "result": "incorrect",
      "explanation": "The premiere date of 'Dornr\\u00f6schen' is stated as December 11, 1902, not May 2011.",
      "article": {
        "url": "http://en.wikipedia.org/?curid=37746387",
        "page_url": "http://en.wikipedia.org/?curid=37746387",
        "section_url": "http://en.wikipedia.org/?curid=37746387#Premiere",
        "title": "Dornr\u00f6schen",
        "section": "Premiere",
        "snippet": "''Dornr\u00f6schen'' premiered on 11 December 1902 at the Stadttheater in Frankfurt-am-Main, with Humperdinck conducting.",
        "references": 2,
        "contributors": 17,
        "last_updated": "2023-02-27 21:27"
      }
    },
    "error": null
  },
  {
    "selection": "Beauty Shop is an original work.",
    "result": {
      "result": "incorrect",
      "explanation": "The film 'Beauty Shop' is actually a spin-off of the 'Barbershop' film series, not an original work.",
      "article": {
        "url": "http://en.wikipedia.org/?curid=1727946",
        "page_url": "http://en.wikipedia.org/?curid=1727946",
        "section_url": "http://en.wikipedia.org/?curid=1727946#Lead_Section",
        "title": "Beauty Shop",
        "section": "Lead Section",
        "snippet": "'Beauty Shop''''' is a 2005 American comedy film directed by Bille Woodruff. The film serves as a Spin-off (media)|spin-off of the ''Barber",
        "references": 16,
        "contributors": 247,
        "last_updated": "2024-02-08 11:30"
      }
    },
    "error": null
  },
  {
    "selection": "Philadelphia contains 67 National Historic Landmarks.",
    "result": {
      "result": "correct",
      "explanation": "The statement is directly supported by the text passage.",
      "article": {
        "url": "http://en.wikipedia.org/?curid=15023927",
        "page_url": "http://en.wikipedia.org/?curid=15023927",
        "section_url": "http://en.wikipedia.org/?curid=15023927#Lead_Section",
        "title": "List of National Historic Landmarks in Philadelphia",
        "section": "Lead Section",
        "snippet": "There are 67 National Historic Landmarks within Philadelphia, Pennsylvania.",
        "references": 139,
        "contributors": 60,
        "last_updated": "2024-02-26 16:29"
      }
    },
    "error": null
  },
  {
    "selection": "Eddie Redmayne appeared in a film.",
    "result": {
      "result": "correct",
      "explanation": "The quote confirms that Eddie Redmayne appeared in the film 'Fantastic Beasts and Where to Find Them.'",
      "article": {
        "url": "http://en.wikipedia.org/?curid=7028414",
        "page_url": "http://en.wikipedia.org/?curid=7028414",
        "section_url": "http://en.wikipedia.org/?curid=7028414#Film",
        "title": "Eddie Redmayne",
        "section": "Film",
        "snippet": "2016\n! scope=\"row\"| ''Fantastic Beasts and Where to Find Them (film)|Fantastic Beasts and Where to Find Them''\n| Fantastic Beasts and Where to Find Them#About Newt Scamander|Newt Scamander\n|",
        "references": 250,
        "contributors": 1328,
        "last_updated": "2024-03-08 14:47"
      }
    },
    "error": null
  },
  {
    "selection": "Amelia Earhart was Canadian.",
    "result": {
      "result": "incorrect",
      "explanation": "The text clearly states that Amelia Earhart was born in Atchison, Kansas, not in Canada.",
      "article": {
        "url": "http://en.wikipedia.org/?curid=85234",
        "page_url": "http://en.wikipedia.org/?curid=85234",
        "section_url": "http://en.wikipedia.org/?curid=85234#Childhood",
        "title": "Amelia Earhart",
        "section": "Childhood",
        "snippet": "Earhart was born on July 24, 1897, in Atchison, Kansas|Atchison, Kansas, the daughter of Samuel \"Edwin\" Stanton Earhart (1867\u20131930) and Amelia \"Amy\" (\n\nAccording to family custom, Earhart was named after her two grandmothers, Amelia Josephine",
        "references": 411,
        "contributors": 2431,
        "last_updated": "2024-03-10 19:19"
      }
    },
    "error": null
  },
  {
    "selection": "The Dodecanese are in the southeastern Tyrrhenian Sea.",
    "result": {
      "result": "incorrect",
      "explanation": "The text clearly states that the Sea of Crete is surrounded by the Ionian Sea to the west and the Mediterranean Sea to the east-southeast, not the Tyrrhenian Sea.",
      "article": {
        "url": "http://en.wikipedia.org/?curid=1404590",
        "page_url": "http://en.wikipedia.org/?curid=1404590",
        "section_url": "http://en.wikipedia.org/?curid=1404590#Lead_Section",
        "title": "Sea of Crete",
        "section": "Lead Section",
        "snippet": "The bounding sea to the west is the Ionian Sea. To the northwest is the Myrtoan Sea, a subdivision of the Mediterranean Sea that lies between the Cyclades and Peloponnese. To the east-southeast is the rest of the Mediterranean Sea, sometimes credited as the Levantine Sea.",
        "references": 11,
        "contributors": 105,
        "last_updated": "2024-02-01 22:52"
      }
    },
    "error": null
  },
  {
    "selection": "Death in Paradise has enjoyed high ratings and is highly acclaimed.",
    "result": {
      "result": "partially_correct",
      "explanation": "The statement is partially supported as the show has gained popularity and become a global phenomenon, but the critical response has been mixed.",
      "article": {
        "url": "http://en.wikipedia.org/?curid=33529086",
        "page_url": "http://en.wikipedia.org/?curid=33529086",
        "section_url": "http://en.wikipedia.org/?curid=33529086#Viewing_figures",
        "title": "Death in Paradise (TV series)",
        "section": "Viewing figures",
        "snippet": "From Australia to Russia to India, stretching across 236 territories, this British crime comedy-drama has become a global phenomenon.",
        "references": 84,
        "contributors": 832,
        "last_updated": "2024-03-11 20:18"
      }
    },
    "error": null
  },
  {
    "selection": "London is in Greater London.",
    "result": {
      "result": "correct",
      "explanation": "The statement is directly supported by the text.",
      "article": {
        "url": "http://en.wikipedia.org/?curid=45367389",
        "page_url": "http://en.wikipedia.org/?curid=45367389",
        "section_url": "http://en.wikipedia.org/?curid=45367389#Lead_Section",
        "title": "Greater London",
        "section": "Lead Section",
        "snippet": "Greater London''' is the administrative area of London, England, which is coterminous with the '''London reg",
        "references": 82,
        "contributors": 950,
        "last_updated": "2024-03-10 10:31"
      }
    },
    "error": null
  },
  {
    "selection": "Equidae includes some species known only from their bones.",
    "result": {
      "result": "correct",
      "explanation": "The statement is supported by the mention of Equus species known only from their bones in the Hagerman horse example.",
      "article": {
        "url": "http://en.wikipedia.org/?curid=10490785",
        "page_url": "http://en.wikipedia.org/?curid=10490785",
        "section_url": "http://en.wikipedia.org/?curid=10490785#Miocene_and_Pliocene:_true_equines",
        "title": "Evolution of the horse",
        "section": "Miocene and Pliocene: true equines",
        "snippet": "The Hagerman horse|famous fossils found near Hagerman, Idaho, were originally thought to be a part of the genus ''Plesippus''. Hagerman Fossil Beds National Monument|Hagerman Fossil Beds (Idaho) is a Pliocene site, dating to about 3.5 mya. The fossilized remains were originally called ''Plesippus shoshonensis'', but further study by paleontologists determined the fossils represented the oldest remains of the genus ''Equus''. Their estimated average weight was 425&nbsp;kg, roughly the size of an Arabian horse.",
        "references": 123,
        "contributors": 692,
        "last_updated": "2024-02-22 18:14"
      }
    },
    "error": null
  },
  {
    "selection": "The Eagles were active in the 1970s.",
    "result": {
      "result": "correct",
      "explanation": "The quote confirms that The Eagles were active and successful in the 1970s.",
      "article": {
        "url": "http://en.wikipedia.org/?curid=15221658",
        "page_url": "http://en.wikipedia.org/?curid=15221658",
        "section_url": "http://en.wikipedia.org/?curid=15221658#North_America",
        "title": "1970s in music",
        "section": "North America",
        "snippet": "The Eagles themselves emerged as one of the most successful rock acts of all time, producing albums that included ''Hotel California (E",
        "references": 48,
        "contributors": 619,
        "last_updated": "2024-01-06 00:04"
      }
    },
    "error": null
  },
  {
    "selection": "The 2013 NBA draft was planned at Barclays Center in Brooklyn.",
    "result": {
      "result": "correct",
      "explanation": "The statement is directly supported by the text.",
      "article": {
        "url": "http://en.wikipedia.org/?curid=38000871",
        "page_url": "http://en.wikipedia.org/?curid=38000871",
        "section_url": "http://en.wikipedia.org/?curid=38000871#Lead_Section",
        "title": "2013 NBA draft",
        "section": "Lead Section",
        "snippet": "2013 NBA draft''' was held on June 27, 2013, at the Barclays Center in Brooklyn, New York.",
        "references": 87,
        "contributors": 487,
        "last_updated": "2024-03-10 10:03"
      }
    },
    "error": null
  },
  {
    "selection": "Alex Rodriguez was suspended for 500 games.",
    "result": {
      "result": "incorrect",
      "explanation": "The suspension was not for 500 games, but for the entirety of the 2014 regular season and postseason.",
      "article": {
        "url": "http://en.wikipedia.org/?curid=212472",
        "page_url": "http://en.wikipedia.org/?curid=212472",
        "section_url": "http://en.wikipedia.org/?curid=212472#2014:_Suspension_due_to_Biogenesis_scandal",
        "title": "Alex Rodriguez",
        "section": "2014: Suspension due to Biogenesis scandal",
        "snippet": "Rodriguez's suspension that was announced the previous season but delayed pending an appeal, was upheld, meaning that he would be suspended for the entirety of the 2014 regular season and postseason.",
        "references": 403,
        "contributors": 2960,
        "last_updated": "2024-02-25 18:43"
      }
    },
    "error": null
  },
  {
    "selection": "Mickey Rooney was in a movie.",
    "result": {
      "result": "correct",
      "explanation": "The text clearly states that Mickey Rooney was an actor in films.",
      "article": {
        "url": "http://en.wikipedia.org/?curid=44788090",
        "page_url": "http://en.wikipedia.org/?curid=44788090",
        "section_url": "http://en.wikipedia.org/?curid=44788090#Lead_Section",
        "title": "Mickey Rooney filmography",
        "section": "Lead Section",
        "snippet": "1945\nMickey Rooney (1920\u20132014) was an Americans|American actor of stage, film, television, Broadway theatre|Broadway, radio, and vaudeville. Beginning as a child actor, his career extended over 88 years, making him one of the most enduring perf",
        "references": 10,
        "contributors": 103,
        "last_updated": "2023-12-20 14:37"
      }
    },
    "error": null
  },
  {
    "selection": "Mission: Impossible 6 is written by a person.",
    "result": {
      "result": "correct",
      "explanation": "The statement is supported by the text passage, which mentions that Christopher McQuarrie wrote the film.",
      "article": {
        "url": "http://en.wikipedia.org/?curid=39278339",
        "page_url": "http://en.wikipedia.org/?curid=39278339",
        "section_url": "http://en.wikipedia.org/?curid=39278339#Lead_Section",
        "title": "Mission: Impossible \u2013 Rogue Nation",
        "section": "Lead Section",
        "snippet": "}\n\n'''''Mission: Impossible \u2013 Rogue Nation''''' is a 2015 American action film|action spy film written and directed by Christopher McQuarrie from a story by McQuarrie and Drew Pearce.",
        "references": 156,
        "contributors": 1046,
        "last_updated": "2024-03-14 04:25"
      }
    },
    "error": null
  },
  {
    "selection": "Believe is a work.",
    "result": {
      "result": "partially_correct",
      "explanation": "The quote supports the idea that belief can be based on finding a hypothesis worth investigating, but it does not explicitly state that belief is a work.",
      "article": {
        "url": "http://en.wikipedia.org/?curid=6402253",
        "page_url": "http://en.wikipedia.org/?curid=6402253",
        "section_url": "http://en.wikipedia.org/?curid=6402253#The_lecture",
        "title": "The Will to Believe",
        "section": "The lecture",
        "snippet": "A chemist finds a hypothesis live enough to spend a year in its verification: he believes in it to that extent.",
        "references": 5,
        "contributors": 119,
        "last_updated": "2023-10-23 00:01"
      }
    },
    "error": null
  },
  {
    "selection": "Russ is a rapper.",
    "result": {
      "result": "correct",
      "explanation": "The statement is directly supported by the text, which identifies Russ as an American rapper.",
      "article": {
        "url": "http://en.wikipedia.org/?curid=51286436",
        "page_url": "http://en.wikipedia.org/?curid=51286436",
        "section_url": "http://en.wikipedia.org/?curid=51286436#Lead_Section",
        "title": "Russ (rapper)",
        "section": "Lead Section",
        "snippet": "Russell James Vitale''' (born September 26, 1992), known Mononym|mononymously as '''Russ''', is an American rapper, singer, songwriter, and record pr",
        "references": 71,
        "contributors": 667,
        "last_updated": "2024-02-22 22:10"
      }
    },
    "error": null
  },
  {
    "selection": "Eliza Dushka is incapable of having any roles in films.",
    "result": {
      "result": "incorrect",
      "explanation": "The statement is contradicted by the fact that Eliza Dushku has had roles in various films throughout her career.",
      "article": {
        "url": "http://en.wikipedia.org/?curid=236447",
        "page_url": "http://en.wikipedia.org/?curid=236447",
        "section_url": "http://en.wikipedia.org/?curid=236447#Career",
        "title": "Eliza Dushku",
        "section": "Career",
        "snippet": "She has had many roles as a \"bad girl\" in films.",
        "references": 174,
        "contributors": 1648,
        "last_updated": "2024-03-09 06:42"
      }
    },
    "error": null
  },
  {
    "selection": "The Weeknd only released an album in 2011.",
    "result": {
      "result": "incorrect",
      "explanation": "The statement is contradicted by the fact that The Weeknd released studio albums in 2013, 2015, 2016, 2020, and 2022, not just in 2011.",
      "article": {
        "url": "http://en.wikipedia.org/?curid=31329803",
        "page_url": "http://en.wikipedia.org/?curid=31329803",
        "section_url": "http://en.wikipedia.org/?curid=31329803#Life_and_career",
        "title": "The Weeknd",
        "section": "Life and career",
        "snippet": "On May 17, 2013, Tesfaye released the Kiss Land (song)|title track to his debut studio",
        "references": 750,
        "contributors": 4185,
        "last_updated": "2024-03-12 05:53"
      }
    },
    "error": null
  },
  {
    "selection": "Michael J. Fox had a virus.",
    "result": {
      "result": "incorrect",
      "explanation": "The text is about foxes as animals, not about Michael J. Fox.",
      "article": {
        "url": "http://en.wikipedia.org/?curid=11299",
        "page_url": "http://en.wikipedia.org/?curid=11299",
        "section_url": "http://en.wikipedia.org/?curid=11299#Lead_Section",
        "title": "Fox",
        "section": "Lead Section",
        "snippet": "Foxes live on every continent except Antarctica.",
        "references": 105,
        "contributors": 2722,
        "last_updated": "2024-02-25 01:47"
      }
    },
    "error": null
  },
  {
    "selection": "Felicity Jones appeared in a 2014 British biographical romantic drama film.",
    "result": {
      "result": "correct",
      "explanation": "The statement is directly supported by the text.",
      "article": {
        "url": "http://en.wikipedia.org/?curid=4586225",
        "page_url": "http://en.wikipedia.org/?curid=4586225",
        "section_url": "http://en.wikipedia.org/?curid=4586225#Lead_Section",
        "title": "Felicity Jones",
        "section": "Lead Section",
        "snippet": "Her performance as Jane Hawking in the 2014 biographical film ''The Theory of Everything (2014 film)|The Theory of Everything'' earned her nominations for the BAFTA Award for Best Actres",
        "references": 157,
        "contributors": 885,
        "last_updated": "2024-03-12 10:18"
      }
    },
    "error": null
  },
  {
    "selection": "Heinrich Himmler oversaw all internal and external police of Nazi Germany.",
    "result": {
      "result": "correct",
      "explanation": "The statement is directly supported by the text passage, which mentions that Himmler oversaw all internal and external police and security forces of Nazi Germany.",
      "article": {
        "url": "http://en.wikipedia.org/?curid=13436",
        "page_url": "http://en.wikipedia.org/?curid=13436",
        "section_url": "http://en.wikipedia.org/?curid=13436#Lead_Section",
        "title": "Heinrich Himmler",
        "section": "Lead Section",
        "snippet": "He was known for good organisational skills and for selecting highly competent subordinates, such as Reinhard Heydrich in 1931. From 1943 onwards, he was both Chief of the ''Kriminalpolizei (Nazi Germany)|Kriminalpolizei'' (Criminal Police) and Minister of the Interior, overseeing all internal and external police and security forces, including t",
        "references": 77,
        "contributors": 2530,
        "last_updated": "2024-03-12 00:32"
      }
    },
    "error": null
  },
  {
    "selection": "Hotel Hell is a TV series.",
    "result": {
      "result": "correct",
      "explanation": "The statement is directly supported by the text, which confirms that 'Hotel Hell' is indeed a reality television series.",
      "article": {
        "url": "http://en.wikipedia.org/?curid=34754752",
        "page_url": "http://en.wikipedia.org/?curid=34754752",
        "section_url": "http://en.wikipedia.org/?curid=34754752#Lead_Section",
        "title": "Hotel Hell",
        "section": "Lead Section",
        "snippet": "'''''Hotel Hell''''' is an American reality television series created, hosted and narrated by Gordon Ramsay, which ran on the Fox Broadcasting Company|Fox network for three seasons from 2012 It was Ramsay's fourth series for the Fox network.",
        "references": 74,
        "contributors": 229,
        "last_updated": "2024-02-05 05:24"
      }
    },
    "error": null
  },
  {
    "selection": "The Catalyst is a single by Linkin Park.",
    "result": {
      "result": "correct",
      "explanation": "The statement is directly supported by the text passage.",
      "article": {
        "url": "http://en.wikipedia.org/?curid=28005401",
        "page_url": "http://en.wikipedia.org/?curid=28005401",
        "section_url": "http://en.wikipedia.org/?curid=28005401#Lead_Section",
        "title": "The Catalyst",
        "section": "Lead Section",
        "snippet": "The Catalyst'''\" is a song by the American Rock music|rock band Linkin Park. Released on August 2, 2010,",
        "references": 75,
        "contributors": 440,
        "last_updated": "2023-12-19 01:57"
      }
    },
    "error": null
  },
  {
    "selection": "Wilt Chamberlain plays basketball.",
    "result": {
      "result": "correct",
      "explanation": "The quote directly states that Wilt Chamberlain played basketball in the NBA.",
      "article": {
        "url": "http://en.wikipedia.org/?curid=255645",
        "page_url": "http://en.wikipedia.org/?curid=255645",
        "section_url": "http://en.wikipedia.org/?curid=255645#Lead_Section",
        "title": "Wilt Chamberlain",
        "section": "Lead Section",
        "snippet": "Wilton Norman Chamberlain''' ( tall, he played Center (basketball)|center in the National Basketball Association (NBA) for 14 seasons",
        "references": 308,
        "contributors": 2268,
        "last_updated": "2024-03-12 04:39"
      }
    },
    "error": null
  },
  {
    "selection": "Warren Buffett developed an interest in investing in his youth.",
    "result": {
      "result": "correct",
      "explanation": "The text explicitly states that Warren Buffett had an interest in business and investing at a young age.",
      "article": {
        "url": "http://en.wikipedia.org/?curid=211518",
        "page_url": "http://en.wikipedia.org/?curid=211518",
        "section_url": "http://en.wikipedia.org/?curid=211518#Early_life_and_education",
        "title": "Warren Buffett",
        "section": "Early life and education",
        "snippet": "Buffett showcased an interest in business and investing at a young age. He was inspired by a book he borrowed from the Omaha public library at age seven, ''One Thousand Ways to Make $1000''.",
        "references": 449,
        "contributors": 3933,
        "last_updated": "2024-03-02 02:31"
      }
    },
    "error": null
  },
  {
    "selection": "One Russian superhero is Black Widow.",
    "result": {
      "result": "incorrect",
      "explanation": "The statement is incorrect because Black Widow is not a superhero, but a highly trained former-KGB assassin and former agent of S.H.I.E.L.D.",
      "article": {
        "url": "http://en.wikipedia.org/?curid=37497391",
        "page_url": "http://en.wikipedia.org/?curid=37497391",
        "section_url": "http://en.wikipedia.org/?curid=37497391#Cast",
        "title": "Black Widow (2021 film)",
        "section": "Cast",
        "snippet": "Alexei Shostakov / Red Guardian:<br />The Russian super-soldier counterpart to Steve Rogers (Marvel Cinematic Universe)|Captain America and father-figure to Romanoff",
        "references": 576,
        "contributors": 956,
        "last_updated": "2024-03-03 22:33"
      }
    },
    "error": null
  },
  {
    "selection": "Argo has at least one producer.",
    "result": {
      "result": "correct",
      "explanation": "The passage clearly states that George Clooney, Grant Heslov, and David Klawans were producers of the project based on the article.",
      "article": {
        "url": "http://en.wikipedia.org/?curid=33028800",
        "page_url": "http://en.wikipedia.org/?curid=33028800",
        "section_url": "http://en.wikipedia.org/?curid=33028800#Production",
        "title": "Argo (2012 film)",
        "section": "Production",
        "snippet": "is based on the \"Canadian Caper\" that took place during the Iran hostage crisis in 1979 and 1980. Chris Terrio wrote the screenplay based on Joshuah Bearman's 2007 article \"How the CIA Used a Fake Sci-Fi Flick to Rescue Americans from Tehran,\" which was published in ''Wired (magazine)|Wired''.\n\nIn 2007, the producers George Clooney, Grant Heslov and David Klawans set up a project based on the article. Affleck's participation was announced i",
        "references": 124,
        "contributors": 1371,
        "last_updated": "2024-03-11 16:14"
      }
    },
    "error": null
  },
  {
    "selection": "Captain America: The Winter Soldier is a work.",
    "result": {
      "result": "correct",
      "explanation": "The statement is supported by the text as it clearly states that 'Captain America: The Winter Soldier' is a film.",
      "article": {
        "url": "http://en.wikipedia.org/?curid=36439749",
        "page_url": "http://en.wikipedia.org/?curid=36439749",
        "section_url": "http://en.wikipedia.org/?curid=36439749#Lead_Section",
        "title": "Captain America: The Winter Soldier",
        "section": "Lead Section",
        "snippet": "''Captain America: The Winter Soldier''''' is a 2014 American superhero film based on the Marvel Comics character Captain America, produced by Marvel Studios and distributed by Walt Disney Studios Motion Pictures",
        "references": 438,
        "contributors": 1370,
        "last_updated": "2024-03-12 09:13"
      }
    },
    "error": null
  },
  {
    "selection": "Rhona Mitra acts.",
    "result": {
      "result": "correct",
      "explanation": "The statement is supported by the list of roles Rhona Mitra is known for.",
      "article": {
        "url": "http://en.wikipedia.org/?curid=462070",
        "page_url": "http://en.wikipedia.org/?curid=462070",
        "section_url": "http://en.wikipedia.org/?curid=462070#Lead_Section",
        "title": "Rhona Mitra",
        "section": "Lead Section",
        "snippet": "Mitra is known for her roles as Sonja in ''Underworld: Rise of the Lycans'' (2009); as Major Rachel Dalton on the second and third seasons of ''Strike Back (TV series)|Strike Back'' (2012\u20132013); as Rachel Scott in the first two seasons of ''The Last Ship (TV series)|The Last Ship'' (2014\u20132015); Holly Marie Begins on the sixth season of ''Party of Five'' (1999\u20132000); as Kate Hedges in ''Ali G Indahouse'' (2002); as List of Boston Legal characters|Tara Wilson on the final season of ''The Practice'' (2003\u20132004) and the first and second seasons of ''Boston Legal'' (2004\u20132005); as List of Nip/Tuck characters#Other characters|Detective Kit McGraw on the third season of ''Nip/Tuck'' (2005); in the lead role of the science fiction/action film ''Doomsday (2008 film)|Doomsday'' as Major Eden Sinclair (2008); as an assassin in the Netflix film ''Game Over, Man!'' (2018); and as Mercy Grav",
        "references": 36,
        "contributors": 793,
        "last_updated": "2024-02-19 06:31"
      }
    },
    "error": null
  },
  {
    "selection": "Robert Redford was a guest star on a show.",
    "result": {
      "result": "no_result",
      "explanation": "No matching citations found."
    },
    "error": null
  },
  {
    "selection": "The Matrix stars Keanu Reeves as John Matrix.",
    "result": {
      "result": "incorrect",
      "explanation": "The character played by Keanu Reeves is Neo, not John Matrix.",
      "article": {
        "url": "http://en.wikipedia.org/?curid=61567171",
        "page_url": "http://en.wikipedia.org/?curid=61567171",
        "section_url": "http://en.wikipedia.org/?curid=61567171#Cast",
        "title": "The Matrix Resurrections",
        "section": "Cast",
        "snippet": "Keanu Reeves as Neo (The Matrix)|Neo / Thomas Anderson",
        "references": 231,
        "contributors": 1112,
        "last_updated": "2024-03-05 06:19"
      }
    },
    "error": null
  },
  {
    "selection": "Roman Reigns is a three-time born again Christian.",
    "result": {
      "result": "incorrect",
      "explanation": "The text does not mention Roman Reigns being a three-time born again Christian.",
      "article": {
        "url": "http://en.wikipedia.org/?curid=4373640",
        "page_url": "http://en.wikipedia.org/?curid=4373640",
        "section_url": "http://en.wikipedia.org/?curid=4373640#Personal_life",
        "title": "Roman Reigns",
        "section": "Personal life",
        "snippet": "In 2018, Anoa\u02bbi shared that he had been living with chronic myeloid leukemia, an incurable but treatable form of blood cancer.",
        "references": 483,
        "contributors": 1642,
        "last_updated": "2024-03-06 23:43"
      }
    },
    "error": null
  },
  {
    "selection": "Alison Brie works as an actress.",
    "result": {
      "result": "correct",
      "explanation": "The text clearly states that Alison Brie began her career as an actress with roles in television series like 'Hannah Montana' and 'Mad Men.'",
      "article": {
        "url": "http://en.wikipedia.org/?curid=24382329",
        "page_url": "http://en.wikipedia.org/?curid=24382329",
        "section_url": "http://en.wikipedia.org/?curid=24382329#Career",
        "title": "Alison Brie",
        "section": "Career",
        "snippet": "Her first television role came in 2006 as Nina, a novice hairdresser, on the Disney Channel sitcom ''Hannah Montana''. She received further recognition as Trudy Campbell in the AMC (TV channel)|AMC period drama series ''Mad Men'' (2007\u20132015), which won her the Screen Actors Guild Award for Outstanding Performance by an Ensemble",
        "references": 112,
        "contributors": 910,
        "last_updated": "2024-03-14 00:55"
      }
    },
    "error": null
  }
]
