@startuml
autonumber
title
<b>dlocal India Recurring PayTM/UPI payment sequence (RECURRING CHARGE) </b>
end title


participant "Recurring Processor" as A
participant "Database" as B
participant "Queue" as E
participant "IPN Listener" as C
participant "UPI Queue Consumer" as F
participant "Donation Queue Consumer" as G
participant "Jobs Runner" as H
participant "dLocal" as D
actor User

activate A
A -> A: Identify payment to charge
activate B
A -> B:  Update contribution_recur record
note right: status='Processing'

activate D
deactivate B
A -> D: Make Prenotification API call (24h before scheduled payment)
D --> A: PENDING response
note left: prenotify_approved=false, status_code=100
activate B
A -> B: Update contribution_recur"
note right: status='In Progress'. next_sched_date = +1month
deactivate B

deactivate A
D -> User: Send Donor prenotiy SMS
User --> D : Donor confirms prenotify
D -> C: PENDING IPN received
note left: prenotify_approved=true, status_code=100
activate C
deactivate C
D -> D: dLocal processes payment <font color="red">24 hours later</font>
D -> C: Paid IPN sent
note left: status_code=200

activate C
D -> User: Send Donor post-charge notification SMS

C -> E: Push message to jobs-dlocal
activate E
deactivate C
deactivate E
note left:includes $recurring_payment_token

H -> E: Pull message from jobs-dlocal
activate H
H -> H: Process message
H -> E: Push message to upi-donations queue
deactivate H

F -> E: Pull message from upi-donations queue
activate F
F -> F: Finds existing contribution_recur record\nso pass straight on to donations queue
note left:add $msg['contribution_recur_id'] and $msg ['contact_id']
F -> E: Push message to donations queue
deactivate F

G -> E: Pull message from donations queue
activate G
G -> G: Insert contribution record
@enduml
