{
	"name": "CodexExample",
	"author": [
		"Anne Tomasevich"
	],
	"url": "https://www.mediawiki.org/wiki/Extension:CodexExample",
	"descriptionmsg": "codexexample-desc",
	"license-name": "GPL-2.0-or-later",
	"type": "other",
	"requires": {
		"MediaWiki": ">= 1.42.0"
	},
	"AutoloadNamespaces": {
		"MediaWiki\\Extension\\CodexExample\\": "includes/"
	},
	"MessagesDirs": {
		"CodexExample": [
			"i18n"
		]
	},
	"ExtensionMessagesFiles": {
		"CodexExampleAlias": "CodexExample.alias.php"
	},
	"SpecialPages": {
		"CodexExample": "MediaWiki\\Extension\\CodexExample\\SpecialCodexExample"
	},
	"ResourceFileModulePaths": {
		"localBasePath": "resources",
		"remoteExtPath": "CodexExample/resources"
	},
	"ResourceModules": {
		"ext.codexExample": {
			"class": "MediaWiki\\ResourceLoader\\CodexModule",
			"dependencies": [
				"vue"
			],
			"messages": [
				"codexexample-app-tab-label-button",
				"codexexample-app-tab-label-message",
				"codexexample-app-tab-label-lookup",
				"codexexample-app-tab-label-dialog",
				"codexexample-app-counter-value",
				"codexexample-app-counter-increase",
				"codexexample-app-counter-decrease",
				"codexexample-app-message-type-legend",
				"codexexample-app-message-layout-label",
				"codexexample-app-message-type-notice",
				"codexexample-app-message-type-warning",
				"codexexample-app-message-type-error",
				"codexexample-app-message-type-success",
				"codexexample-app-message-text",
				"codexexample-app-lookup-label",
				"codexexample-app-lookup-no-results",
				"codexexample-app-lookup-description",
				"codexexample-app-dialog-close-button-label",
				"codexexample-app-launch-simple-dialog",
				"codexexample-app-launch-complex-dialog",
				"codexexample-app-simple-dialog-title",
				"codexexample-app-simple-dialog-text",
				"codexexample-app-simple-dialog-default-action-button",
				"codexexample-app-complex-dialog-heading",
				"codexexample-app-complex-dialog-subheading",
				"codexexample-app-complex-dialog-slots-description",
				"codexexample-app-complex-dialog-teleport-description",
				"codexexample-app-complex-dialog-close-button-with-icon",
				"codexexample-app-complex-dialog-primary-action-button"
			],
			"styles": [],
			"packageFiles": [
				"ext.codexExample/init.js",
				"ext.codexExample/components/App.vue",
				"ext.codexExample/components/ButtonDemo.vue",
				"ext.codexExample/components/DialogDemo.vue",
				"ext.codexExample/components/LookupDemo.vue",
				"ext.codexExample/components/MessageDemo.vue",
				{
					"name": "ext.codexExample/icons.json",
					"callback": "MediaWiki\\ResourceLoader\\CodexModule::getIcons",
					"callbackParam": [
						"cdxIconAdd",
						"cdxIconClose"
					]
				}
			],
			"codexComponents": [
				"CdxButton",
				"CdxCard",
				"CdxDialog",
				"CdxIcon",
				"CdxLookup",
				"CdxMessage",
				"CdxRadio",
				"CdxTab",
				"CdxTabs",
				"CdxToggleSwitch"
			]
		},
		"ext.codexExample.styles": {
			"class": "MediaWiki\\ResourceLoader\\CodexModule",
			"styles": "ext.codexExample.styles/styles.less",
			"codexStyleOnly": "true",
			"codexComponents": [
				"CdxButton",
				"CdxCard",
				"CdxCheckbox",
				"CdxProgressBar"
			]
		}
	},
	"manifest_version": 2
}
