acls:
  enable: false
  modify_groups: []
  modify_users: []
  ui_users: []
  view_groups: []
  view_users: []
file_systems: []
master:
  env:
    PYSPARK_DRIVER_PYTHON: venv/bin/python
    PYSPARK_PYTHON: venv/bin/python
    SPARK_CONF_DIR: /etc/spark3/conf
    SPARK_HOME: venv/lib/python3.10/site-packages/pyspark
  files:
    airflow.keytab:
      size: 0
      source: file:///pytest/path/to/airflow.keytab
      timestamp: 0
      type: FILE
      visibility: APPLICATION
    venv:
      size: 0
      source: hdfs:///wmf/cache/artifacts/airflow/analytics/mediawiki-content-dump-0.3.0-v0.3.0.conda.tgz
      timestamp: 0
      type: ARCHIVE
      visibility: APPLICATION
  log_level: INFO
  resources:
    fpgas: 0
    gpus: 0
    memory: 8192
    vcores: 4
  script: venv/bin/spark-submit --driver-cores 4 --conf spark.executorEnv.PYSPARK_DRIVER_PYTHON=venv/bin/python
    --conf spark.executorEnv.PYSPARK_PYTHON=venv/bin/python --conf spark.executorEnv.SPARK_CONF_DIR=/etc/spark3/conf
    --conf spark.executorEnv.SPARK_HOME=venv/lib/python3.10/site-packages/pyspark
    --master yarn --conf spark.shuffle.service.name=spark_shuffle_3_3 --conf spark.shuffle.service.port=7338
    --conf spark.yarn.archive=hdfs:///user/spark/share/lib/spark-3.3.2-assembly.zip
    --conf spark.jars.packages=org.apache.iceberg:iceberg-spark-runtime-3.3_2.12:1.6.1,org.wikimedia:eventutilities-spark:1.4.1
    --conf spark.jars.ivySettings=/etc/maven/ivysettings.xml --conf 'spark.driver.extraJavaOptions=-Divy.cache.dir=/tmp/pytest_user/ivy_spark3/cache
    -Divy.home=/tmp/pytest_user/ivy_spark3/home' --conf spark.dynamicAllocation.maxExecutors=16
    --conf spark.sql.shuffle.partitions=64 --conf spark.jars=hdfs:///wmf/cache/artifacts/airflow/analytics/mysql-connector-j-8.2.0.jar,hdfs:///wmf/cache/artifacts/airflow/analytics/refinery-spark-0.2.54.jar
    --conf spark.hadoop.mapreduce.fileoutputcommitter.algorithm.version=2 --conf spark.yarn.appMasterEnv.SPARK_HOME=venv/lib/python3.10/site-packages/pyspark
    --conf spark.yarn.appMasterEnv.SPARK_CONF_DIR=/etc/spark3/conf --conf spark.yarn.appMasterEnv.PYSPARK_PYTHON=venv/bin/python
    --conf spark.yarn.appMasterEnv.PYSPARK_DRIVER_PYTHON=venv/bin/python --archives
    'hdfs:///wmf/cache/artifacts/airflow/analytics/mediawiki-content-dump-0.3.0-v0.3.0.conda.tgz#venv'
    --executor-cores 2 --executor-memory 8G --driver-memory 8G --keytab airflow.keytab
    --principal airflow --name mw_content_reconcile_mw_content_history_daily__reconcile.spark_emit_reconcile_events_to_kafka__20250114
    --queue production --deploy-mode client venv/bin/emit_reconcile_events_to_kafka.py
    --wiki_id abwiki --inconsistent_rows_table wmf_content.inconsistent_rows_of_mediawiki_content_history_v1
    --wikis_table canonical_data.wikis --namespaces_table wmf_raw.mediawiki_project_namespace_map
    --namespaces_table_snapshot 2024-12 --computation_class last-24h --computation_dt
    2025-01-15T00:00:00 --max_events_per_iteration 100000 --event_stream_name mediawiki.content_history_reconcile.v1
    --event_schema_version 1.2.0 --kafka_bootstrap_servers kafka-jumbo1007.eqiad.wmnet:9092,kafka-jumbo1008.eqiad.wmnet:9092,kafka-jumbo1010.eqiad.wmnet:9092
    --mariadb_username research --mariadb_password_file /user/analytics/mysql-analytics-research-client-pw.txt
max_attempts: 1
name: Airflow SparkSkeinSubmitHook skein launcher mw_content_reconcile_mw_content_history_daily__reconcile.spark_emit_reconcile_events_to_kafka__20250114
node_label: ''
queue: production
services: {}
tags: []
user: ''
