acls:
  enable: false
  modify_groups: []
  modify_users: []
  ui_users: []
  view_groups: []
  view_users: []
file_systems: []
master:
  env:
    SPARK_CONF_DIR: /etc/spark3/conf
    SPARK_HOME: /usr/lib/spark3
  files:
    airflow.keytab:
      size: 0
      source: file:///pytest/path/to/airflow.keytab
      timestamp: 0
      type: FILE
      visibility: APPLICATION
  log_level: INFO
  resources:
    fpgas: 0
    gpus: 0
    memory: 1024
    vcores: 1
  script: spark3-submit --driver-cores 1 --master local --conf spark.dynamicAllocation.enabled=true
    --conf spark.dynamicAllocation.maxExecutors=16 --conf spark.shuffle.service.enabled=true
    --conf spark.yarn.maxAppAttempts=1 --conf spark.hadoop.mapreduce.fileoutputcommitter.algorithm.version=2
    --executor-cores 2 --executor-memory 4G --driver-memory 1G --keytab airflow.keytab
    --principal airflow --name refine_webrequest_hourly_text__add_raw_webrequest_partition__20230411
    --class org.apache.spark.sql.hive.thriftserver.WMFSparkSQLCLIDriver --queue production
    --deploy-mode client hdfs:///wmf/cache/artifacts/airflow/analytics/wmf-sparksqlclidriver-1.0.0.jar
    -f hdfs://analytics-hadoop/wmf/refinery/current/hql/utils/hive/add_partition.hql
    -d table=wmf_raw.webrequest -d 'partition_spec=webrequest_source='"'"'text'"'"',year=2023,month=4,day=11,hour=15'
    -d location=hdfs://analytics-hadoop/wmf/data/raw/webrequest/webrequest_text/year=2023/month=04/day=11/hour=15
max_attempts: 1
name: Airflow SparkSkeinSubmitHook skein launcher refine_webrequest_hourly_text__add_raw_webrequest_partition__20230411
node_label: ''
queue: production
services: {}
tags: []
user: ''
