acls:
  enable: false
  modify_groups: []
  modify_users: []
  ui_users: []
  view_groups: []
  view_users: []
file_systems: []
master:
  env:
    SPARK_CONF_DIR: /etc/spark3/conf
    SPARK_HOME: /usr/lib/spark3
  files:
    airflow.keytab:
      size: 0
      source: file:///pytest/path/to/airflow.keytab
      timestamp: 0
      type: FILE
      visibility: APPLICATION
  log_level: INFO
  resources:
    fpgas: 0
    gpus: 0
    memory: 8192
    vcores: 2
  script: spark3-submit --driver-cores 2 --conf spark.executorEnv.SPARK_HOME=/usr/lib/spark3
    --conf spark.executorEnv.SPARK_CONF_DIR=/etc/spark3/conf --master yarn --conf
    spark.dynamicAllocation.enabled=true --conf spark.dynamicAllocation.maxExecutors=64
    --conf spark.shuffle.service.enabled=true --conf spark.yarn.maxAppAttempts=1 --conf
    spark.hadoop.fs.permissions.umask-mode=0027 --conf spark.hadoop.mapreduce.fileoutputcommitter.algorithm.version=2
    --conf spark.yarn.appMasterEnv.SPARK_CONF_DIR=/etc/spark3/conf --conf spark.yarn.appMasterEnv.SPARK_HOME=/usr/lib/spark3
    --executor-cores 4 --executor-memory 8g --driver-memory 8g --keytab airflow.keytab
    --principal airflow --name subgraph_query_metrics_daily__extract_subgraph_pair_query_metrics__20220703
    --class org.wikidata.query.rdf.spark.metrics.SubgraphMetricsLauncher --queue production
    --deploy-mode client hdfs:///wmf/cache/artifacts/airflow/search/rdf-spark-tools-0.3.146-jar-with-dependencies.jar
    subgraph-pair-query-metrics --subgraph-query-table discovery.subgraph_queries/year=2022/month=7/day=3/wiki=wikidata
    --subgraph-pair-query-metrics-table discovery.subgraph_pair_query_metrics/year=2022/month=7/day=3/wiki=wikidata
max_attempts: 1
name: Airflow SparkSkeinSubmitHook skein launcher subgraph_query_metrics_daily__extract_subgraph_pair_query_metrics__20220703
node_label: ''
queue: production
services: {}
tags: []
user: ''
