acls:
  enable: false
  modify_groups: []
  modify_users: []
  ui_users: []
  view_groups: []
  view_users: []
file_systems: []
master:
  env:
    SPARK_CONF_DIR: /etc/spark3/conf
    SPARK_HOME: /usr/lib/spark3
  files:
    airflow.keytab:
      size: 0
      source: file:///pytest/path/to/airflow.keytab
      timestamp: 0
      type: FILE
      visibility: APPLICATION
  log_level: INFO
  resources:
    fpgas: 0
    gpus: 0
    memory: 16384
    vcores: 2
  script: spark3-submit --driver-cores 2 --conf spark.executorEnv.SPARK_HOME=/usr/lib/spark3
    --conf spark.executorEnv.SPARK_CONF_DIR=/etc/spark3/conf --master yarn --conf
    spark.datahub.emitter=kafka --conf spark.extraListeners=datahub.spark.DatahubSparkListener
    --conf spark.datahub.kafka.bootstrap=test.kafka.jumbo:9092 --conf spark.datahub.kafka.schema_registry_url=https://test.schema.registry:30443/schema-registry/api/
    --conf spark.datahub.flow_name=airflow_edit_hourly__process_edit_hourly --conf
    spark.dynamicAllocation.maxExecutors=128 --conf spark.executor.memoryOverhead=2048
    --conf spark.hadoop.fs.permissions.umask-mode=022 --conf spark.hadoop.mapreduce.fileoutputcommitter.algorithm.version=2
    --conf spark.yarn.appMasterEnv.SPARK_CONF_DIR=/etc/spark3/conf --conf spark.yarn.appMasterEnv.SPARK_HOME=/usr/lib/spark3
    --jars hdfs:///wmf/cache/artifacts/airflow/analytics/acryl-spark-lineage-0.2.16.jar
    --executor-cores 2 --executor-memory 8G --driver-memory 16G --keytab airflow.keytab
    --principal airflow --name edit_hourly__process_edit_hourly__20230401 --class
    org.apache.spark.sql.hive.thriftserver.WMFSparkSQLCLIDriver --queue production
    --deploy-mode client hdfs:///wmf/cache/artifacts/airflow/analytics/wmf-sparksqlclidriver-1.0.0.jar
    -f hdfs://analytics-hadoop/wmf/refinery/current/hql/edit/edit_hourly.hql -d source_table=wmf.mediawiki_history
    -d wiki_map_table=canonical_data.wikis -d destination_table=wmf.edit_hourly -d
    snapshot=2023-03 -d coalesce_partitions=64
max_attempts: 1
name: Airflow SparkSkeinSubmitHook skein launcher edit_hourly__process_edit_hourly__20230401
node_label: ''
queue: production
services: {}
tags: []
user: ''
