acls:
  enable: false
  modify_groups: []
  modify_users: []
  ui_users: []
  view_groups: []
  view_users: []
file_systems: []
master:
  env:
    SPARK_CONF_DIR: /etc/spark3/conf
    SPARK_HOME: /usr/lib/spark3
  files:
    airflow.keytab:
      size: 0
      source: file:///pytest/path/to/airflow.keytab
      timestamp: 0
      type: FILE
      visibility: APPLICATION
  log_level: INFO
  resources:
    fpgas: 0
    gpus: 0
    memory: 4096
    vcores: 2
  script: spark3-submit --driver-cores 1 --master 'local[1]' --conf spark.yarn.maxAppAttempts=1
    --conf write.spark.accept-any-schema=true --conf spark.hadoop.mapreduce.fileoutputcommitter.algorithm.version=2
    --conf spark.executor.memoryOverhead=384MB --conf spark.dynamicAllocation.maxExecutors=1
    --executor-cores 1 --executor-memory 2G --driver-memory 3G --keytab airflow.keytab
    --principal airflow --name refine_to_hive_hourly__refine_hive_dataset.refine_to_hive_hourly__2024080817__3_ios_search
    --class org.wikimedia.analytics.refinery.job.refine.cli.RefineHiveDataset --queue
    launchers --deploy-mode client hdfs:///wmf/cache/artifacts/airflow/analytics/refinery-job-0.2.50-shaded.jar
    --input_paths /wmf/data/raw/event/eqiad.ios.search/year=2024/month=08/day=08/hour=17,/wmf/data/raw/event/codfw.ios.search/year=2024/month=08/day=08/hour=17
    --schema_uri /analytics/mobile_apps/ios_search/latest --table event_alt.ios_search
    --transform_functions org.wikimedia.analytics.refinery.job.refine.remove_canary_events,org.wikimedia.analytics.refinery.job.refine.deduplicate,org.wikimedia.analytics.refinery.job.refine.geocode_ip,org.wikimedia.analytics.refinery.job.refine.parse_user_agent,org.wikimedia.analytics.refinery.job.refine.add_is_wmf_domain,org.wikimedia.analytics.refinery.job.refine.add_normalized_host,org.wikimedia.analytics.refinery.job.refine.normalizeFieldNamesAndWidenTypes
    --partition_paths datacenter=eqiad/year=2024/month=8/day=8/hour=17,datacenter=codfw/year=2024/month=8/day=8/hour=17
    --spark_job_scale small --ignore_missing_paths True
max_attempts: 1
name: Airflow SparkSkeinSubmitHook skein launcher refine_to_hive_hourly__refine_hive_dataset.refine_to_hive_hourly__2024080817__3_ios_search
node_label: ''
queue: launchers
services: {}
tags: []
user: ''
