acls:
  enable: false
  modify_groups: []
  modify_users: []
  ui_users: []
  view_groups: []
  view_users: []
file_systems: []
master:
  env:
    SPARK_CONF_DIR: /etc/spark3/conf
    SPARK_HOME: /usr/lib/spark3
  files:
    airflow.keytab:
      size: 0
      source: file:///pytest/path/to/airflow.keytab
      timestamp: 0
      type: FILE
      visibility: APPLICATION
  log_level: INFO
  resources:
    fpgas: 0
    gpus: 0
    memory: 4096
    vcores: 2
  script: spark3-submit --driver-cores 2 --conf spark.executorEnv.SPARK_HOME=/usr/lib/spark3
    --conf spark.executorEnv.SPARK_CONF_DIR=/etc/spark3/conf --master yarn --conf
    spark.datahub.emitter=kafka --conf spark.extraListeners=datahub.spark.DatahubSparkListener
    --conf spark.datahub.kafka.bootstrap=test.kafka.jumbo:9092 --conf spark.datahub.kafka.schema_registry_url=https://test.schema.registry:30443/schema-registry/api/
    --conf spark.datahub.flow_name=airflow_unique_devices_per_project_family_daily__dump_per_project_family_daily
    --conf spark.dynamicAllocation.enabled=true --conf spark.dynamicAllocation.maxExecutors=16
    --conf spark.shuffle.service.enabled=true --conf spark.yarn.maxAppAttempts=1 --conf
    spark.hadoop.mapreduce.fileoutputcommitter.algorithm.version=2 --conf spark.yarn.appMasterEnv.SPARK_CONF_DIR=/etc/spark3/conf
    --conf spark.yarn.appMasterEnv.SPARK_HOME=/usr/lib/spark3 --jars hdfs:///wmf/cache/artifacts/airflow/analytics/acryl-spark-lineage-0.2.16.jar
    --executor-cores 2 --executor-memory 4G --driver-memory 4G --keytab airflow.keytab
    --principal airflow --name unique_devices_per_project_family_daily__dump_per_project_family_daily__20231019
    --class org.apache.spark.sql.hive.thriftserver.WMFSparkSQLCLIDriver --queue production
    --deploy-mode client hdfs:///wmf/cache/artifacts/airflow/analytics/wmf-sparksqlclidriver-1.0.0.jar
    -f hdfs://analytics-hadoop/wmf/refinery/current/hql/unique_devices/per_project_family/unique_devices_per_project_family_daily_to_archive.hql
    -d source_table=wmf.unique_devices_per_project_family_daily -d destination_directory=/wmf/tmp/analytics/unique_devices/per_project_family/daily/2023-10-19
    -d year=2023 -d month=10 -d day=18
max_attempts: 1
name: Airflow SparkSkeinSubmitHook skein launcher unique_devices_per_project_family_daily__dump_per_project_family_daily__20231019
node_label: ''
queue: production
services: {}
tags: []
user: ''
