{
  "dag_id": "knowledge_gaps",
  "default_view": "grid",
  "description": null,
  "file_token": ".eJxT0i8uKtNPSS3Iya_MTc0r0U_MLErLyS_XTUlML9YvSi1OTSxKzkAwwMLZefnlOakp6anx6YkFxfFAMb2CSiUAOqEcjw.dOrhAOCy0Ae_zEIgK9dd876EfC0",
  "fileloc": "/srv/deployment/airflow-dags/research/research/dags/knowledge_gaps_dag.py",
  "has_import_errors": false,
  "has_task_concurrency_limits": true,
  "is_active": true,
  "is_paused": false,
  "is_subdag": false,
  "last_expired": null,
  "last_parsed_time": "2024-08-05T21:33:35.403462+00:00",
  "last_pickled": null,
  "max_active_runs": 3,
  "max_active_tasks": 6,
  "next_dagrun": "2024-08-01T00:00:00+00:00",
  "next_dagrun_create_after": "2024-09-01T00:00:00+00:00",
  "next_dagrun_data_interval_end": "2024-09-01T00:00:00+00:00",
  "next_dagrun_data_interval_start": "2024-08-01T00:00:00+00:00",
  "owners": [
    "analytics-research"
  ],
  "pickle_id": null,
  "root_dag_id": null,
  "schedule_interval": {
    "__type": "CronExpression",
    "value": "@monthly"
  },
  "scheduler_lock": null,
  "tags": [
    {
      "name": "spark"
    },
    {
      "name": "research"
    },
    {
      "name": "knowledge gaps"
    },
    {
      "name": "hive"
    }
  ],
  "timetable_description": "At 00:00, on day 1 of the month"
}
