acls:
  enable: false
  modify_groups: []
  modify_users: []
  ui_users: []
  view_groups: []
  view_users: []
file_systems: []
master:
  env:
    PYSPARK_DRIVER_PYTHON: venv/bin/python
    PYSPARK_PYTHON: venv/bin/python
    SPARK_CONF_DIR: /etc/spark3/conf
    SPARK_HOME: /usr/lib/spark3
  files:
    airflow.keytab:
      size: 0
      source: file:///pytest/path/to/airflow.keytab
      timestamp: 0
      type: FILE
      visibility: APPLICATION
    venv:
      size: 0
      source: hdfs:///wmf/cache/artifacts/airflow/research/research_datasets.tgz
      timestamp: 0
      type: ARCHIVE
      visibility: APPLICATION
  log_level: INFO
  resources:
    fpgas: 0
    gpus: 0
    memory: 8192
    vcores: 4
  script: 'spark3-submit --driver-cores 4 --conf spark.executorEnv.PYSPARK_DRIVER_PYTHON=venv/bin/python
    --conf spark.executorEnv.PYSPARK_PYTHON=venv/bin/python --conf spark.executorEnv.SPARK_HOME=/usr/lib/spark3
    --conf spark.executorEnv.SPARK_CONF_DIR=/etc/spark3/conf --master yarn --conf
    spark.hadoop.fs.permissions.umask-mode=022 --conf spark.sql.sources.partitionOverwriteMode=dynamic
    --conf spark.sql.shuffle.partitions=4096 --conf spark.sql.adaptive.enabled=true
    --conf spark.network.timeout=1200s --conf spark.dynamicAllocation.maxExecutors=98
    --conf spark.executor.memoryOverhead=4G --conf spark.hadoop.mapreduce.fileoutputcommitter.algorithm.version=2
    --conf spark.yarn.appMasterEnv.SPARK_CONF_DIR=/etc/spark3/conf --conf spark.yarn.appMasterEnv.SPARK_HOME=/usr/lib/spark3
    --conf spark.yarn.appMasterEnv.PYSPARK_PYTHON=venv/bin/python --conf spark.yarn.appMasterEnv.PYSPARK_DRIVER_PYTHON=venv/bin/python
    --archives ''hdfs:///wmf/cache/artifacts/airflow/research/research_datasets.tgz#venv''
    --executor-cores 4 --executor-memory 12G --driver-memory 8G --keytab airflow.keytab
    --principal airflow --name article_topics__compute_article_topics__20240601 --queue
    production --deploy-mode client venv/bin/research_datasets_pipelines.py articletopics.pipeline.run
    ''{"mediawiki_snapshot": "2024-05", "wikidata_snapshot": "2024-04-29", "model_url":
    "https://analytics.wikimedia.org/published/wmf-ml-models/articletopic/outlink/20221111111111/model.bin",
    "output": "/tmp/research/article_topics", "max_files_per_wiki": 8, "wikis": null}'''
max_attempts: 1
name: Airflow SparkSkeinSubmitHook skein launcher article_topics__compute_article_topics__20240601
node_label: ''
queue: production
services: {}
tags: []
user: ''
