acls:
  enable: false
  modify_groups: []
  modify_users: []
  ui_users: []
  view_groups: []
  view_users: []
file_systems: []
master:
  env:
    SPARK_CONF_DIR: /etc/spark3/conf
    SPARK_HOME: /usr/lib/spark3
  files:
    airflow.keytab:
      size: 0
      source: file:///pytest/path/to/airflow.keytab
      timestamp: 0
      type: FILE
      visibility: APPLICATION
  log_level: INFO
  resources:
    fpgas: 0
    gpus: 0
    memory: 4096
    vcores: 2
  script: spark3-submit --driver-cores 2 --conf spark.executorEnv.SPARK_HOME=/usr/lib/spark3
    --conf spark.executorEnv.SPARK_CONF_DIR=/etc/spark3/conf --master yarn --conf
    spark.dynamicAllocation.enabled=true --conf spark.dynamicAllocation.maxExecutors=16
    --conf spark.shuffle.service.enabled=true --conf spark.yarn.maxAppAttempts=1 --conf
    spark.hadoop.mapreduce.fileoutputcommitter.algorithm.version=2 --conf spark.yarn.appMasterEnv.SPARK_CONF_DIR=/etc/spark3/conf
    --conf spark.yarn.appMasterEnv.SPARK_HOME=/usr/lib/spark3 --executor-cores 2 --executor-memory
    4G --driver-memory 4G --keytab airflow.keytab --principal airflow --name webrequest_analyzer__webrequest_metrics__20231201
    --class org.wikimedia.analytics.refinery.job.dataquality.WebrequestMetrics --queue
    production --deploy-mode client hdfs:///wmf/cache/artifacts/airflow/analytics/refinery-job-0.2.45-shaded.jar
    --table wmf.webrequest --metrics_table wmf_data_ops.data_quality_metrics --alerts_table
    wmf_data_ops.data_quality_alerts --alerts_output_path /wmf/tmp/analytics/webrequest_alerts/pytest_render_task
    --partition_map year:2023,month:12,day:1,hour:1 --run_id pytest_render_task
max_attempts: 1
name: Airflow SparkSkeinSubmitHook skein launcher webrequest_analyzer__webrequest_metrics__20231201
node_label: ''
queue: production
services: {}
tags: []
user: ''
