acls:
  enable: false
  modify_groups: []
  modify_users: []
  ui_users: []
  view_groups: []
  view_users: []
file_systems: []
master:
  env: {}
  files:
    airflow.keytab:
      size: 0
      source: file:///pytest/path/to/airflow.keytab
      timestamp: 0
      type: FILE
      visibility: APPLICATION
    venv:
      size: 0
      source: hdfs:///wmf/cache/artifacts/airflow/search/discolytics-0.28.0.conda.tgz
      timestamp: 0
      type: ARCHIVE
      visibility: APPLICATION
  log_level: INFO
  resources:
    fpgas: 0
    gpus: 0
    memory: 2048
    vcores: 1
  script: kinit -k -t airflow.keytab airflow && venv/bin/python venv/bin/refinery_drop_mediawiki_snapshots.py
    --verbose
max_attempts: 1
name: drop_old_data_daily__drop_snapshot_partitioned_partitions__20230303
node_label: ''
queue: production
services: {}
tags: []
user: ''
