acls:
  enable: false
  modify_groups: []
  modify_users: []
  ui_users: []
  view_groups: []
  view_users: []
file_systems: []
master:
  env:
    PYSPARK_DRIVER_PYTHON: venv/bin/python
    PYSPARK_PYTHON: venv/bin/python
    SPARK_CONF_DIR: /etc/spark3/conf
    SPARK_HOME: /usr/lib/spark3
  files:
    airflow.keytab:
      size: 0
      source: file:///pytest/path/to/airflow.keytab
      timestamp: 0
      type: FILE
      visibility: APPLICATION
    venv:
      size: 0
      source: hdfs:///wmf/cache/artifacts/airflow/platform_eng/section-topics-1.1.0-v1.1.0.conda.tgz
      timestamp: 0
      type: ARCHIVE
      visibility: APPLICATION
  log_level: INFO
  resources:
    fpgas: 0
    gpus: 0
    memory: 4096
    vcores: 2
  script: spark3-submit --driver-cores 2 --conf spark.executorEnv.PYSPARK_DRIVER_PYTHON=venv/bin/python
    --conf spark.executorEnv.PYSPARK_PYTHON=venv/bin/python --conf spark.executorEnv.SPARK_HOME=/usr/lib/spark3
    --conf spark.executorEnv.SPARK_CONF_DIR=/etc/spark3/conf --master yarn --conf
    spark.dynamicAllocation.enabled=true --conf spark.dynamicAllocation.maxExecutors=16
    --conf spark.shuffle.service.enabled=true --conf spark.yarn.maxAppAttempts=1 --conf
    spark.hadoop.mapreduce.fileoutputcommitter.algorithm.version=2 --conf spark.yarn.appMasterEnv.SPARK_CONF_DIR=/etc/spark3/conf
    --conf spark.yarn.appMasterEnv.SPARK_HOME=/usr/lib/spark3 --conf spark.yarn.appMasterEnv.PYSPARK_PYTHON=venv/bin/python
    --conf spark.yarn.appMasterEnv.PYSPARK_DRIVER_PYTHON=venv/bin/python --archives
    'hdfs:///wmf/cache/artifacts/airflow/platform_eng/section-topics-1.1.0-v1.1.0.conda.tgz#venv'
    --executor-cores 2 --executor-memory 4G --driver-memory 4G --keytab airflow.keytab
    --principal airflow --name detect_html_tables__detect_html_tables__20241022 --queue
    production --deploy-mode client venv/lib/python3.10/site-packages/section_topics/scripts/detect_html_tables.py
    20241020 --dumps-path '/user/analytics-platform-eng/structured-data/section_topics/dumps/{snapshot}/{wiki}-NS0-{snapshot}-ENTERPRISE-HTML.json.tar.gz'
    --wikis arwiki bnwiki cswiki eswiki idwiki ptwiki ruwiki ckbwiki frrwiki hywiki
    jvwiki kuwiki newiki pawiki simplewiki skwiki sqwiki --output /user/analytics-platform-eng/structured-data/section_topics/target_wikis_tables/20241020
max_attempts: 1
name: Airflow SparkSkeinSubmitHook skein launcher detect_html_tables__detect_html_tables__20241022
node_label: ''
queue: production
services: {}
tags: []
user: ''
