acls:
  enable: false
  modify_groups: []
  modify_users: []
  ui_users: []
  view_groups: []
  view_users: []
file_systems: []
master:
  env:
    SPARK_CONF_DIR: /etc/spark3/conf
    SPARK_HOME: /usr/lib/spark3
  files:
    airflow.keytab:
      size: 0
      source: file:///pytest/path/to/airflow.keytab
      timestamp: 0
      type: FILE
      visibility: APPLICATION
  log_level: INFO
  resources:
    fpgas: 0
    gpus: 0
    memory: 4096
    vcores: 2
  script: "spark3-submit --driver-cores 2 --conf spark.executorEnv.SPARK_HOME=/usr/lib/spark3\
    \ --conf spark.executorEnv.SPARK_CONF_DIR=/etc/spark3/conf --master yarn --conf\
    \ spark.dynamicAllocation.maxExecutors=20 --conf spark.hadoop.fs.permissions.umask-mode=0022\
    \ --conf spark.executor.memoryOverhead=6G --conf spark.hadoop.mapreduce.fileoutputcommitter.algorithm.version=2\
    \ --conf spark.yarn.appMasterEnv.SPARK_CONF_DIR=/etc/spark3/conf --conf spark.yarn.appMasterEnv.SPARK_HOME=/usr/lib/spark3\
    \ --executor-cores 2 --executor-memory 10G --driver-memory 4G --keytab airflow.keytab\
    \ --principal airflow --name popularity_score_weekly__popularity_score__20200126\
    \ --class org.apache.spark.sql.hive.thriftserver.WMFSparkSQLCLIDriver --queue\
    \ production --deploy-mode client hdfs:///wmf/cache/artifacts/airflow/search/wmf-sparksqlclidriver-1.0.0.jar\
    \ -e '\nINSERT OVERWRITE TABLE discovery.popularity_score\n    PARTITION(\n  \
    \      agg_days=7,\n        year=2020,\n        month=1,\n        day=26)\n  \
    \  SELECT\n        /*+ COALESCE(6) */\n        /*+ BROADCAST(agg) */\n       \
    \ hourly.project,\n        hourly.page_id,\n        hourly.namespace_id as page_namespace,\n\
    \        SUM(hourly.view_count) / agg.view_count AS score\n    FROM\n        wmf.pageview_hourly\
    \ hourly\n    JOIN (\n        SELECT\n            project,\n            SUM(view_count)\
    \ AS view_count\n        FROM\n            wmf.pageview_hourly\n        WHERE\n\
    \            page_id IS NOT NULL\n            AND (\n            ( year = 2020\
    \ AND month = 01 AND day = 26 ) OR ( year = 2020 AND month = 01 AND day = 27 )\
    \ OR ( year = 2020 AND month = 01 AND day = 28 ) OR ( year = 2020 AND month =\
    \ 01 AND day = 29 ) OR ( year = 2020 AND month = 01 AND day = 30 ) OR ( year =\
    \ 2020 AND month = 01 AND day = 31 ) OR ( year = 2020 AND month = 02 AND day =\
    \ 01 )\n            )\n        GROUP BY\n            project\n        ) agg on\
    \ hourly.project = agg.project\n    WHERE\n        hourly.page_id IS NOT NULL\n\
    \        AND (\n        ( year = 2020 AND month = 01 AND day = 26 ) OR ( year\
    \ = 2020 AND month = 01 AND day = 27 ) OR ( year = 2020 AND month = 01 AND day\
    \ = 28 ) OR ( year = 2020 AND month = 01 AND day = 29 ) OR ( year = 2020 AND month\
    \ = 01 AND day = 30 ) OR ( year = 2020 AND month = 01 AND day = 31 ) OR ( year\
    \ = 2020 AND month = 02 AND day = 01 )\n        )\n    GROUP BY\n        hourly.project,\n\
    \        hourly.page_id,\n        hourly.namespace_id,\n        agg.view_count'"
max_attempts: 1
name: Airflow SparkSkeinSubmitHook skein launcher popularity_score_weekly__popularity_score__20200126
node_label: ''
queue: production
services: {}
tags: []
user: ''
