{"streams": {
  "eventlogging_CentralNoticeBannerHistory": {
    "schema_title": "analytics/legacy/centralnoticebannerhistory",
    "topic_prefixes": null,
    "destination_event_service": "eventgate-analytics-external",
    "consumers": {
      "analytics_hadoop_ingestion": {
        "job_name": "eventlogging_legacy",
        "enabled": true
      }
    },
    "canary_events_enabled": true,
    "stream": "eventlogging_CentralNoticeBannerHistory",
    "topics": [
      "eventlogging_CentralNoticeBannerHistory"
    ]
  },
  "eventlogging_CentralNoticeImpression": {
    "schema_title": "analytics/legacy/centralnoticeimpression",
    "topic_prefixes": null,
    "destination_event_service": "eventgate-analytics-external",
    "consumers": {
      "analytics_hadoop_ingestion": {
        "job_name": "eventlogging_legacy",
        "enabled": true
      }
    },
    "canary_events_enabled": true,
    "stream": "eventlogging_CentralNoticeImpression",
    "topics": [
      "eventlogging_CentralNoticeImpression"
    ]
  }
}}