acls:
  enable: false
  modify_groups: []
  modify_users: []
  ui_users: []
  view_groups: []
  view_users: []
file_systems: []
master:
  env:
    SPARK_CONF_DIR: /etc/spark3/conf
    SPARK_HOME: /usr/lib/spark3
  files:
    airflow.keytab:
      size: 0
      source: file:///pytest/path/to/airflow.keytab
      timestamp: 0
      type: FILE
      visibility: APPLICATION
  log_level: INFO
  resources:
    fpgas: 0
    gpus: 0
    memory: 4096
    vcores: 2
  script: spark3-submit --driver-cores 2 --conf spark.executorEnv.SPARK_HOME=/usr/lib/spark3
    --conf spark.executorEnv.SPARK_CONF_DIR=/etc/spark3/conf --master yarn --conf
    spark.dynamicAllocation.maxExecutors=128 --conf spark.hadoop.mapreduce.fileoutputcommitter.algorithm.version=2
    --conf spark.yarn.appMasterEnv.SPARK_CONF_DIR=/etc/spark3/conf --conf spark.yarn.appMasterEnv.SPARK_HOME=/usr/lib/spark3
    --executor-cores 2 --executor-memory 8G --driver-memory 4G --keytab airflow.keytab
    --principal airflow --name backfill_webrequest_actor_metrics_hourly_2024_12__backfill_compute_webrequest_actor_metrics_2024_12__20240703
    --class org.apache.spark.sql.hive.thriftserver.WMFSparkSQLCLIDriver --queue production
    --deploy-mode client hdfs:///wmf/cache/artifacts/airflow/analytics/wmf-sparksqlclidriver-1.0.0.jar
    -f hdfs://analytics-hadoop/wmf/refinery/current/hql/webrequest/actor/backfill_webrequest_actor_metrics_hourly_2024_12.hql
    -d source_table=wmf.pageview_actor -d destination_table=wmf.webrequest_actor_metrics_hourly
    -d refinery_hive_jar_path=hdfs:///wmf/cache/artifacts/airflow/analytics/refinery-hive-0.2.54-shaded.jar
    -d version=0.2 -d coalesce_partitions=4 -d year=2024 -d month=7 -d day=3 -d hour=9
max_attempts: 1
name: Airflow SparkSkeinSubmitHook skein launcher backfill_webrequest_actor_metrics_hourly_2024_12__backfill_compute_webrequest_actor_metrics_2024_12__20240703
node_label: ''
queue: production
services: {}
tags: []
user: ''
