acls:
  enable: false
  modify_groups: []
  modify_users: []
  ui_users: []
  view_groups: []
  view_users: []
file_systems: []
master:
  env:
    PYSPARK_DRIVER_PYTHON: venv/bin/python
    PYSPARK_PYTHON: venv/bin/python
    SPARK_CONF_DIR: /etc/spark3/conf
    SPARK_HOME: /usr/lib/spark3
  files:
    airflow.keytab:
      size: 0
      source: file:///pytest/path/to/airflow.keytab
      timestamp: 0
      type: FILE
      visibility: APPLICATION
    venv:
      size: 0
      source: hdfs:///wmf/cache/artifacts/airflow/platform_eng/image-suggestions-1.0.0-v1.0.0.conda.tgz
      timestamp: 0
      type: ARCHIVE
      visibility: APPLICATION
  log_level: INFO
  resources:
    fpgas: 0
    gpus: 0
    memory: 8192
    vcores: 2
  script: spark3-submit --driver-cores 2 --conf spark.executorEnv.PYSPARK_DRIVER_PYTHON=venv/bin/python
    --conf spark.executorEnv.PYSPARK_PYTHON=venv/bin/python --conf spark.executorEnv.SPARK_HOME=/usr/lib/spark3
    --conf spark.executorEnv.SPARK_CONF_DIR=/etc/spark3/conf --master yarn --conf
    spark.dynamicAllocation.enabled=true --conf spark.dynamicAllocation.maxExecutors=64
    --conf spark.shuffle.service.enabled=true --conf spark.yarn.maxAppAttempts=1 --conf
    spark.sql.shuffle.partitions=256 --conf spark.sql.sources.partitionOverwriteMode=dynamic
    --conf spark.hadoop.mapreduce.fileoutputcommitter.algorithm.version=2 --conf spark.yarn.appMasterEnv.SPARK_CONF_DIR=/etc/spark3/conf
    --conf spark.yarn.appMasterEnv.SPARK_HOME=/usr/lib/spark3 --conf spark.yarn.appMasterEnv.PYSPARK_PYTHON=venv/bin/python
    --conf spark.yarn.appMasterEnv.PYSPARK_DRIVER_PYTHON=venv/bin/python --archives
    'hdfs:///wmf/cache/artifacts/airflow/platform_eng/image-suggestions-1.0.0-v1.0.0.conda.tgz#venv'
    --executor-cores 4 --executor-memory 8g --driver-memory 8g --keytab airflow.keytab
    --principal airflow --name SLIS__slis__20241107 --queue production --deploy-mode
    client venv/lib/python3.10/site-packages/image_suggestions/slis.py analytics_platform_eng
    2024-10-28 4 /user/analytics-platform-eng/structured-data/section_topics/topics/2024-10-28
    /user/analytics-platform-eng/structured-data/section_topics/section_alignment_image_suggestions/2024-10-28
    /user/analytics-platform-eng/structured-data/section_topics/images/2024-10-28
    --denylist /user/analytics-platform-eng/structured-data/section_topics/section_titles_denylist/2024-10-28
max_attempts: 1
name: Airflow SparkSkeinSubmitHook skein launcher SLIS__slis__20241107
node_label: ''
queue: production
services: {}
tags: []
user: ''
