acls:
  enable: false
  modify_groups: []
  modify_users: []
  ui_users: []
  view_groups: []
  view_users: []
file_systems: []
master:
  env:
    SPARK_CONF_DIR: /etc/spark3/conf
    SPARK_HOME: /usr/lib/spark3
  files:
    airflow.keytab:
      size: 0
      source: file:///pytest/path/to/airflow.keytab
      timestamp: 0
      type: FILE
      visibility: APPLICATION
  log_level: INFO
  resources:
    fpgas: 0
    gpus: 0
    memory: 16384
    vcores: 4
  script: spark3-submit --driver-cores 4 --conf spark.executorEnv.SPARK_HOME=/usr/lib/spark3
    --conf spark.executorEnv.SPARK_CONF_DIR=/etc/spark3/conf --master yarn --conf
    spark.sql.autoBroadcastJoinThreshold=-1 --conf spark.sql.iceberg.locality.enabled=false
    --conf spark.hadoop.mapreduce.fileoutputcommitter.algorithm.version=2 --conf spark.yarn.appMasterEnv.SPARK_CONF_DIR=/etc/spark3/conf
    --conf spark.yarn.appMasterEnv.SPARK_HOME=/usr/lib/spark3 --executor-cores 2 --executor-memory
    8g --driver-memory 16g --keytab airflow.keytab --principal airflow --name table_maintenance_iceberg_monthly__wmf_data_ops__data_quality_metrics.remove_orphan_files__20241101
    --class org.apache.spark.sql.hive.thriftserver.WMFSparkSQLCLIDriver --queue production
    --deploy-mode client hdfs:///wmf/cache/artifacts/airflow/analytics/wmf-sparksqlclidriver-1.0.0.jar
    -e 'CALL spark_catalog.system.remove_orphan_files( table => '"'"'wmf_data_ops.data_quality_metrics'"'"',
    older_than => TIMESTAMP '"'"'2024-10-30T00:00:00'"'"', max_concurrent_deletes
    => 10 )'
max_attempts: 1
name: Airflow SparkSkeinSubmitHook skein launcher table_maintenance_iceberg_monthly__wmf_data_ops__data_quality_metrics.remove_orphan_files__20241101
node_label: ''
queue: production
services: {}
tags: []
user: ''
