acls:
  enable: false
  modify_groups: []
  modify_users: []
  ui_users: []
  view_groups: []
  view_users: []
file_systems: []
master:
  env:
    SPARK_CONF_DIR: /etc/spark3/conf
    SPARK_HOME: /usr/lib/spark3
  files:
    airflow.keytab:
      size: 0
      source: file:///pytest/path/to/airflow.keytab
      timestamp: 0
      type: FILE
      visibility: APPLICATION
  log_level: INFO
  resources:
    fpgas: 0
    gpus: 0
    memory: 4096
    vcores: 2
  script: "spark3-submit --driver-cores 2 --conf spark.executorEnv.SPARK_HOME=/usr/lib/spark3\
    \ --conf spark.executorEnv.SPARK_CONF_DIR=/etc/spark3/conf --master yarn --conf\
    \ spark.dynamicAllocation.enabled=true --conf spark.dynamicAllocation.maxExecutors=16\
    \ --conf spark.shuffle.service.enabled=true --conf spark.yarn.maxAppAttempts=1\
    \ --conf spark.hadoop.fs.permissions.umask-mode=0027 --conf spark.hadoop.mapreduce.fileoutputcommitter.algorithm.version=2\
    \ --conf spark.yarn.appMasterEnv.SPARK_CONF_DIR=/etc/spark3/conf --conf spark.yarn.appMasterEnv.SPARK_HOME=/usr/lib/spark3\
    \ --executor-cores 2 --executor-memory 4G --driver-memory 4G --keytab airflow.keytab\
    \ --principal airflow --name query_clicks_init__create_tables__20220208 --class\
    \ org.apache.spark.sql.hive.thriftserver.WMFSparkSQLCLIDriver --queue production\
    \ --deploy-mode client hdfs:///wmf/cache/artifacts/airflow/search/wmf-sparksqlclidriver-1.0.0.jar\
    \ -e '\nCREATE TABLE IF NOT EXISTS discovery.query_clicks_daily(\n  `query` string,\n\
    \  `q_by_ip_day` int,\n  `timestamp` bigint,\n  `wikiid` string,\n  `project`\
    \ string,\n  `hits` array<struct<`title`:string,`index`:string,`pageid`:int,`score`:float,`profilename`:string>>,\n\
    \  `clicks` array<struct<`pageid`:int,`timestamp`:bigint,`referer`:string>>,\n\
    \  `session_id` string,\n  `request_set_token` string\n  -- new fields must be\
    \ added to end to match alter table behaviour\n)\nPARTITIONED BY (\n  `year` int,\n\
    \  `month` int,\n  `day` int\n)\nSTORED AS PARQUET\nLOCATION '\"'\"'hdfs://analytics-hadoop/wmf/data/discovery/query_clicks/daily'\"\
    '\"'\n;\n\nCREATE TABLE IF NOT EXISTS discovery.query_clicks_hourly (\n  `query`\
    \ string,\n  `ip` string,\n  `identity` string,\n  `timestamp` bigint,\n  `wikiid`\
    \ string,\n  `project` string,\n  `hits` array<struct<\n      `title`:string,\n\
    \      `index`:string,\n      `pageid`:int,\n      `score`:float,\n      `profilename`:string\n\
    \  >>,\n  `clicks` array<struct<\n      `pageid`:int,\n      `timestamp`:bigint,\n\
    \      `referer`:string\n  >>,\n  `request_set_token` string\n)\nPARTITIONED BY\
    \ (\n  `year` int,\n  `month` int,\n  `day` int,\n  `hour` int\n)\nSTORED AS PARQUET\n\
    LOCATION '\"'\"'hdfs://analytics-hadoop/wmf/data/discovery/query_clicks/hourly'\"\
    '\"'\n;'"
max_attempts: 1
name: Airflow SparkSkeinSubmitHook skein launcher query_clicks_init__create_tables__20220208
node_label: ''
queue: production
services: {}
tags: []
user: ''
