acls:
  enable: false
  modify_groups: []
  modify_users: []
  ui_users: []
  view_groups: []
  view_users: []
file_systems: []
master:
  env:
    PYSPARK_DRIVER_PYTHON: venv/bin/python
    PYSPARK_PYTHON: venv/bin/python
    SPARK_CONF_DIR: /etc/spark3/conf
    SPARK_HOME: /usr/lib/spark3
  files:
    airflow.keytab:
      size: 0
      source: file:///pytest/path/to/airflow.keytab
      timestamp: 0
      type: FILE
      visibility: APPLICATION
    venv:
      size: 0
      source: hdfs:///wmf/cache/artifacts/airflow/platform_eng/seal-0.4.0-v0.4.0.conda.tgz
      timestamp: 0
      type: ARCHIVE
      visibility: APPLICATION
  log_level: INFO
  resources:
    fpgas: 0
    gpus: 0
    memory: 32768
    vcores: 2
  script: spark3-submit --driver-cores 2 --conf spark.executorEnv.PYSPARK_DRIVER_PYTHON=venv/bin/python
    --conf spark.executorEnv.PYSPARK_PYTHON=venv/bin/python --conf spark.executorEnv.SPARK_HOME=/usr/lib/spark3
    --conf spark.executorEnv.SPARK_CONF_DIR=/etc/spark3/conf --master yarn --conf
    spark.dynamicAllocation.maxExecutors=128 --conf spark.sql.shuffle.partitions=4096
    --conf spark.executor.memoryOverhead=6g --conf spark.shuffle.service.index.cache.size=2048
    --conf spark.stage.maxConsecutiveAttempts=10 --conf spark.reducer.maxReqsInFlight=1
    --conf spark.shuffle.io.maxRetries=10 --conf spark.shuffle.io.retryWait=60s --conf
    spark.hadoop.mapreduce.fileoutputcommitter.algorithm.version=2 --conf spark.yarn.appMasterEnv.SPARK_CONF_DIR=/etc/spark3/conf
    --conf spark.yarn.appMasterEnv.SPARK_HOME=/usr/lib/spark3 --conf spark.yarn.appMasterEnv.PYSPARK_PYTHON=venv/bin/python
    --conf spark.yarn.appMasterEnv.PYSPARK_DRIVER_PYTHON=venv/bin/python --archives
    'hdfs:///wmf/cache/artifacts/airflow/platform_eng/seal-0.4.0-v0.4.0.conda.tgz#venv'
    --executor-cores 4 --executor-memory 12g --driver-memory 32g --keytab airflow.keytab
    --principal airflow --name SEAL__extract_features__20231005 --queue production
    --deploy-mode client venv/lib/python3.10/site-packages/seal/features.py 2023-09-25
    --work-dir /user/analytics-platform-eng/structured-data/seal
max_attempts: 1
name: Airflow SparkSkeinSubmitHook skein launcher SEAL__extract_features__20231005
node_label: ''
queue: production
services: {}
tags: []
user: ''
