acls:
  enable: false
  modify_groups: []
  modify_users: []
  ui_users: []
  view_groups: []
  view_users: []
file_systems: []
master:
  env:
    SPARK_CONF_DIR: /etc/spark3/conf
    SPARK_HOME: /usr/lib/spark3
  files:
    airflow.keytab:
      size: 0
      source: file:///pytest/path/to/airflow.keytab
      timestamp: 0
      type: FILE
      visibility: APPLICATION
  log_level: INFO
  resources:
    fpgas: 0
    gpus: 0
    memory: 16384
    vcores: 2
  script: spark3-submit --driver-cores 2 --conf spark.executorEnv.SPARK_HOME=/usr/lib/spark3
    --conf spark.executorEnv.SPARK_CONF_DIR=/etc/spark3/conf --master yarn --conf
    spark.dynamicAllocation.enabled=true --conf spark.dynamicAllocation.maxExecutors=128
    --conf spark.shuffle.service.enabled=true --conf spark.yarn.maxAppAttempts=1 --conf
    spark.hadoop.fs.permissions.umask-mode=0022 --conf spark.sql.autoBroadcastJoinThreshold=-1
    --conf spark.sql.shuffle.partitions=512 --conf spark.executor.memoryOverhead=4g
    --conf spark.hadoop.mapreduce.fileoutputcommitter.algorithm.version=2 --conf spark.yarn.appMasterEnv.SPARK_CONF_DIR=/etc/spark3/conf
    --conf spark.yarn.appMasterEnv.SPARK_HOME=/usr/lib/spark3 --executor-cores 4 --executor-memory
    12g --driver-memory 16g --keytab airflow.keytab --principal airflow --name import_wikidata_ttl__split_subgraphs__20230217
    --class org.wikidata.query.rdf.spark.transform.structureddata.dumps.ScholarlyArticleSplit
    --queue production --deploy-mode client hdfs:///wmf/cache/artifacts/airflow/search/rdf-spark-tools-0.3.146-jar-with-dependencies.jar
    --input-table-partition-spec discovery.wikibase_rdf/date=20230220/wiki=wikidata
    --output-table-partition-spec discovery.wikibase_rdf_subgraphs/snapshot=20230220/wiki=wikidata
max_attempts: 1
name: Airflow SparkSkeinSubmitHook skein launcher import_wikidata_ttl__split_subgraphs__20230217
node_label: ''
queue: production
services: {}
tags: []
user: ''
