acls:
  enable: false
  modify_groups: []
  modify_users: []
  ui_users: []
  view_groups: []
  view_users: []
file_systems: []
master:
  env:
    SPARK_CONF_DIR: /etc/spark3/conf
    SPARK_HOME: /usr/lib/spark3
  files:
    airflow.keytab:
      size: 0
      source: file:///pytest/path/to/airflow.keytab
      timestamp: 0
      type: FILE
      visibility: APPLICATION
  log_level: INFO
  resources:
    fpgas: 0
    gpus: 0
    memory: 16384
    vcores: 4
  script: spark3-submit --driver-cores 4 --conf spark.executorEnv.SPARK_HOME=/usr/lib/spark3
    --conf spark.executorEnv.SPARK_CONF_DIR=/etc/spark3/conf --master yarn --conf
    spark.dynamicAllocation.enabled=true --conf spark.dynamicAllocation.maxExecutors=32
    --conf spark.shuffle.service.enabled=true --conf spark.yarn.maxAppAttempts=1 --conf
    spark.executor.memoryOverhead=2G --conf spark.hadoop.mapreduce.fileoutputcommitter.algorithm.version=2
    --conf spark.yarn.appMasterEnv.SPARK_CONF_DIR=/etc/spark3/conf --conf spark.yarn.appMasterEnv.SPARK_HOME=/usr/lib/spark3
    --executor-cores 2 --executor-memory 8G --driver-memory 16G --keytab airflow.keytab
    --principal airflow --name mw_content_publish_mw_content_history_to_xml__publish_simplewiki_to_xml__20250401
    --class org.wikimedia.analytics.refinery.job.mediawikidumper.MediawikiDumper --queue
    production --deploy-mode client hdfs:///wmf/cache/artifacts/airflow/analytics/refinery-job-0.2.29-shaded.jar
    --wiki_id simplewiki --publish_until 2025-03-01 --source_table wmf_content.mediawiki_content_history_v1
    --output_folder /wmf/data/archive/content_dump_test/simplewiki/20250301/
max_attempts: 1
name: Airflow SparkSkeinSubmitHook skein launcher mw_content_publish_mw_content_history_to_xml__publish_simplewiki_to_xml__20250401
node_label: ''
queue: production
services: {}
tags: []
user: ''
