acls:
  enable: false
  modify_groups: []
  modify_users: []
  ui_users: []
  view_groups: []
  view_users: []
file_systems: []
master:
  env:
    PYSPARK_DRIVER_PYTHON: venv/bin/python
    PYSPARK_PYTHON: venv/bin/python
    REQUESTS_CA_BUNDLE: /etc/ssl/certs/ca-certificates.crt
    SPARK_CONF_DIR: /etc/spark3/conf
    SPARK_HOME: /usr/lib/spark3
  files:
    airflow.keytab:
      size: 0
      source: file:///pytest/path/to/airflow.keytab
      timestamp: 0
      type: FILE
      visibility: APPLICATION
    venv:
      size: 0
      source: hdfs:///wmf/cache/artifacts/airflow/search/discolytics-0.28.0.conda.tgz
      timestamp: 0
      type: ARCHIVE
      visibility: APPLICATION
  log_level: INFO
  resources:
    fpgas: 0
    gpus: 0
    memory: 8192
    vcores: 2
  script: spark3-submit --driver-cores 2 --conf spark.executorEnv.PYSPARK_DRIVER_PYTHON=venv/bin/python
    --conf spark.executorEnv.PYSPARK_PYTHON=venv/bin/python --conf spark.executorEnv.REQUESTS_CA_BUNDLE=/etc/ssl/certs/ca-certificates.crt
    --conf spark.executorEnv.SPARK_HOME=/usr/lib/spark3 --conf spark.executorEnv.SPARK_CONF_DIR=/etc/spark3/conf
    --master yarn --conf spark.dynamicAllocation.enabled=true --conf spark.dynamicAllocation.maxExecutors=36
    --conf spark.shuffle.service.enabled=true --conf spark.yarn.maxAppAttempts=1 --conf
    spark.hadoop.fs.permissions.umask-mode=0022 --conf spark.executor.extraJavaOptions=-XX:MaxDirectMemorySize=1024M
    --conf spark.hive.exec.max.dynamic.partitions=1100 --conf spark.executor.memoryOverhead=4g
    --conf spark.hadoop.mapreduce.fileoutputcommitter.algorithm.version=2 --conf spark.yarn.appMasterEnv.SPARK_CONF_DIR=/etc/spark3/conf
    --conf spark.yarn.appMasterEnv.SPARK_HOME=/usr/lib/spark3 --conf spark.yarn.appMasterEnv.REQUESTS_CA_BUNDLE=/etc/ssl/certs/ca-certificates.crt
    --conf spark.yarn.appMasterEnv.PYSPARK_PYTHON=venv/bin/python --conf spark.yarn.appMasterEnv.PYSPARK_DRIVER_PYTHON=venv/bin/python
    --archives 'hdfs:///wmf/cache/artifacts/airflow/search/discolytics-0.28.0.conda.tgz#venv'
    --executor-cores 1 --executor-memory 4g --driver-memory 8g --keytab airflow.keytab
    --principal airflow --name import_cirrus_indexes_weekly__import__20230319 --queue
    production --deploy-mode client venv/bin/import_cirrus_indexes.py --elasticsearch
    https://search.svc.codfw.wmnet:9243,https://search.svc.codfw.wmnet:9443,https://search.svc.codfw.wmnet:9643
    --output-partition discovery.cirrus_index/snapshot=20230319
max_attempts: 1
name: Airflow SparkSkeinSubmitHook skein launcher import_cirrus_indexes_weekly__import__20230319
node_label: ''
queue: production
services: {}
tags: []
user: ''
