acls:
  enable: false
  modify_groups: []
  modify_users: []
  ui_users: []
  view_groups: []
  view_users: []
file_systems: []
master:
  env:
    SPARK_CONF_DIR: /etc/spark3/conf
    SPARK_HOME: /usr/lib/spark3
  files:
    airflow.keytab:
      size: 0
      source: file:///pytest/path/to/airflow.keytab
      timestamp: 0
      type: FILE
      visibility: APPLICATION
  log_level: INFO
  resources:
    fpgas: 0
    gpus: 0
    memory: 4096
    vcores: 2
  script: spark3-submit --driver-cores 2 --conf spark.executorEnv.SPARK_HOME=/usr/lib/spark3
    --conf spark.executorEnv.SPARK_CONF_DIR=/etc/spark3/conf --master yarn --conf
    spark.dynamicAllocation.maxExecutors=128 --conf spark.hadoop.mapreduce.fileoutputcommitter.algorithm.version=2
    --conf spark.yarn.appMasterEnv.SPARK_CONF_DIR=/etc/spark3/conf --conf spark.yarn.appMasterEnv.SPARK_HOME=/usr/lib/spark3
    --executor-cores 2 --executor-memory 4G --driver-memory 4G --keytab airflow.keytab
    --principal airflow --name wikidata_metrics_to_graphite_daily__generate_and_send_entity_schema_namespace_metrics__20220604
    --class org.wikimedia.analytics.refinery.job.HiveToGraphite --queue production
    --deploy-mode client hdfs:///wmf/cache/artifacts/airflow/analytics/refinery-job-0.2.1-shaded.jar
    -f hdfs://analytics-hadoop/wmf/refinery/current/hql/wikidata/wikidata_entity_schema_namespace_metrics.hql
    --metric_prefix daily.wikidata.entity_schema.views --graphite_host graphite-in.eqiad.wmnet
    --graphite_port 2003 -d webrequest_table=wmf.webrequest -d year=2022 -d month=6
    -d day=3 -d coalesce_partitions=4
max_attempts: 1
name: Airflow SparkSkeinSubmitHook skein launcher wikidata_metrics_to_graphite_daily__generate_and_send_entity_schema_namespace_metrics__20220604
node_label: ''
queue: production
services: {}
tags: []
user: ''
