acls:
  enable: false
  modify_groups: []
  modify_users: []
  ui_users: []
  view_groups: []
  view_users: []
file_systems: []
master:
  env:
    SPARK_CONF_DIR: /etc/spark3/conf
    SPARK_HOME: /usr/lib/spark3
  files:
    airflow.keytab:
      size: 0
      source: file:///pytest/path/to/airflow.keytab
      timestamp: 0
      type: FILE
      visibility: APPLICATION
  log_level: INFO
  resources:
    fpgas: 0
    gpus: 0
    memory: 32768
    vcores: 4
  script: spark3-submit --driver-cores 4 --conf spark.executorEnv.SPARK_HOME=/usr/lib/spark3
    --conf spark.executorEnv.SPARK_CONF_DIR=/etc/spark3/conf --master yarn --conf
    spark.sql.autoBroadcastJoinThreshold=-1 --conf spark.dynamicAllocation.maxExecutors=64
    --conf spark.hadoop.mapreduce.fileoutputcommitter.algorithm.version=2 --conf spark.yarn.appMasterEnv.SPARK_CONF_DIR=/etc/spark3/conf
    --conf spark.yarn.appMasterEnv.SPARK_HOME=/usr/lib/spark3 --executor-cores 2 --executor-memory
    20g --driver-memory 32g --keytab airflow.keytab --principal airflow --name table_maintenance_iceberg_weekly__wmf_content__mediawiki_content_history_v1.rewrite_data_files__20240901
    --class org.apache.spark.sql.hive.thriftserver.WMFSparkSQLCLIDriver --queue production
    --deploy-mode client hdfs:///wmf/cache/artifacts/airflow/analytics/wmf-sparksqlclidriver-1.0.0.jar
    -e 'CALL spark_catalog.system.rewrite_data_files( table => '"'"'wmf_content.mediawiki_content_history_v1'"'"',
    strategy => '"'"'sort'"'"', sort_order => '"'"'wiki_id ASC NULLS FIRST, page_id
    ASC NULLS FIRST, revision_dt ASC NULLS FIRST'"'"', options => map('"'"'max-file-group-size-bytes'"'"',
    '"'"'53687091200'"'"', '"'"'max-concurrent-file-group-rewrites'"'"', '"'"'10'"'"',
    '"'"'partial-progress.enabled'"'"', '"'"'true'"'"') )'
max_attempts: 1
name: Airflow SparkSkeinSubmitHook skein launcher table_maintenance_iceberg_weekly__wmf_content__mediawiki_content_history_v1.rewrite_data_files__20240901
node_label: ''
queue: production
services: {}
tags: []
user: ''
