acls:
  enable: false
  modify_groups: []
  modify_users: []
  ui_users: []
  view_groups: []
  view_users: []
file_systems: []
master:
  env:
    LD_LIBRARY_PATH: venv/lib
    PYSPARK_DRIVER_PYTHON: venv/bin/python
    PYSPARK_PYTHON: venv/bin/python
    SPARK_CONF_DIR: /etc/spark3/conf
    SPARK_HOME: /usr/lib/spark3
  files:
    airflow.keytab:
      size: 0
      source: file:///pytest/path/to/airflow.keytab
      timestamp: 0
      type: FILE
      visibility: APPLICATION
    venv:
      size: 0
      source: hdfs:///wmf/cache/artifacts/airflow/research/research_datasets.tgz
      timestamp: 0
      type: ARCHIVE
      visibility: APPLICATION
  log_level: INFO
  resources:
    fpgas: 0
    gpus: 0
    memory: 16384
    vcores: 2
  script: 'venv/bin/spark-submit --driver-cores 2 --conf spark.executorEnv.LD_LIBRARY_PATH=venv/lib
    --conf spark.executorEnv.PYSPARK_DRIVER_PYTHON=venv/bin/python --conf spark.executorEnv.PYSPARK_PYTHON=venv/bin/python
    --conf spark.executorEnv.SPARK_HOME=/usr/lib/spark3 --conf spark.executorEnv.SPARK_CONF_DIR=/etc/spark3/conf
    --master yarn --conf spark.dynamicAllocation.maxExecutors=128 --conf spark.driver.maxResultSize=2G
    --conf spark.sql.execution.arrow.pyspark.enabled=True --conf spark.executor.memoryOverhead=2G
    --conf spark.sql.shuffle.partitions=2000 --conf spark.network.timeout=1200s --conf
    spark.shuffle.io.retryWait=1200s --conf spark.hadoop.mapreduce.fileoutputcommitter.algorithm.version=2
    --conf spark.yarn.appMasterEnv.SPARK_CONF_DIR=/etc/spark3/conf --conf spark.yarn.appMasterEnv.SPARK_HOME=/usr/lib/spark3
    --conf spark.yarn.appMasterEnv.PYSPARK_PYTHON=venv/bin/python --conf spark.yarn.appMasterEnv.PYSPARK_DRIVER_PYTHON=venv/bin/python
    --conf spark.yarn.appMasterEnv.LD_LIBRARY_PATH=venv/lib --archives ''hdfs:///wmf/cache/artifacts/airflow/research/research_datasets.tgz#venv''
    --executor-cores 4 --executor-memory 16G --driver-memory 16G --keytab airflow.keytab
    --principal airflow --name mwaddlink__generate_wdproperties__20240502 --queue
    production --deploy-mode client venv/bin/research_datasets_pipelines.py mwaddlink.generatewdproperties.run
    ''{"wikidata_snapshot": "2024-04-29", "wiki_dbs": ["aawiki", "abwiki", "acewiki",
    "adywiki", "afwiki", "akwiki", "alswiki", "altwiki", "amiwiki", "amwiki", "angwiki",
    "anpwiki", "anwiki", "arcwiki", "arwiki", "arywiki", "arzwiki", "astwiki", "aswiki",
    "atjwiki", "avkwiki", "avwiki", "awawiki", "aywiki", "azbwiki", "azwiki", "banwiki",
    "barwiki", "bat_smgwiki", "bawiki", "bbcwiki", "bclwiki", "be_x_oldwiki", "bewiki",
    "bewwiki", "bgwiki", "bhwiki", "biwiki", "bjnwiki", "blkwiki", "bmwiki", "bnwiki",
    "bowiki", "bpywiki", "brwiki", "bswiki", "bugwiki", "bxrwiki", "cawiki", "cbk_zamwiki",
    "cdowiki", "cebwiki", "cewiki", "chowiki", "chrwiki", "chwiki", "chywiki", "ckbwiki",
    "cowiki", "crhwiki", "crwiki", "csbwiki", "cswiki", "cuwiki", "cvwiki", "cywiki",
    "dagwiki", "dawiki", "dewiki", "dgawiki", "dinwiki", "diqwiki", "dsbwiki", "dtpwiki",
    "dtywiki", "dvwiki", "dzwiki", "eewiki", "elwiki", "emlwiki", "enwiki", "eowiki",
    "eswiki", "etwiki", "euwiki", "extwiki", "fatwiki", "fawiki", "ffwiki", "fiu_vrowiki",
    "fiwiki", "fjwiki", "fonwiki", "fowiki", "frpwiki", "frrwiki", "frwiki", "furwiki",
    "fywiki", "gagwiki", "ganwiki", "gawiki", "gcrwiki", "gdwiki", "glkwiki", "glwiki",
    "gnwiki", "gomwiki", "gorwiki", "gotwiki", "gpewiki", "gucwiki", "gurwiki", "guwiki",
    "guwwiki", "gvwiki", "hakwiki", "hawiki", "hawwiki", "hewiki", "hifwiki", "hiwiki",
    "howiki", "hrwiki", "hsbwiki", "htwiki", "huwiki", "hywiki", "hywwiki", "hzwiki",
    "iawiki", "idwiki", "iewiki", "iglwiki", "igwiki", "iiwiki", "ikwiki", "ilowiki",
    "inhwiki", "iowiki", "iswiki", "itwiki", "iuwiki", "jamwiki", "jawiki", "jbowiki",
    "jvwiki", "kaawiki", "kabwiki", "kawiki", "kbdwiki", "kbpwiki", "kcgwiki", "kgwiki",
    "kiwiki", "kjwiki", "kkwiki", "klwiki", "kmwiki", "knwiki", "koiwiki", "kowiki",
    "krcwiki", "krwiki", "kshwiki", "kswiki", "kuswiki", "kuwiki", "kvwiki", "kwwiki",
    "kywiki", "ladwiki", "lawiki", "lbewiki", "lbwiki", "lezwiki", "lfnwiki", "lgwiki",
    "lijwiki", "liwiki", "lldwiki", "lmowiki", "lnwiki", "lowiki", "lrcwiki", "ltgwiki",
    "ltwiki", "lvwiki", "madwiki", "maiwiki", "map_bmswiki", "mdfwiki", "mgwiki",
    "mhrwiki", "mhwiki", "minwiki", "miwiki", "mkwiki", "mlwiki", "mniwiki", "mnwiki",
    "mnwwiki", "mrjwiki", "mrwiki", "mswiki", "mtwiki", "muswiki", "mwlwiki", "myvwiki",
    "mywiki", "mznwiki", "nahwiki", "napwiki", "nawiki", "nds_nlwiki", "ndswiki",
    "newiki", "newwiki", "ngwiki", "niawiki", "nlwiki", "nnwiki", "novwiki", "nowiki",
    "nqowiki", "nrmwiki", "nsowiki", "nvwiki", "nywiki", "ocwiki", "olowiki", "omwiki",
    "orwiki", "oswiki", "pagwiki", "pamwiki", "papwiki", "pawiki", "pcdwiki", "pcmwiki",
    "pdcwiki", "pflwiki", "pihwiki", "piwiki", "plwiki", "pmswiki", "pnbwiki", "pntwiki",
    "pswiki", "ptwiki", "pwnwiki", "quwiki", "rmwiki", "rmywiki", "rnwiki", "roa_rupwiki",
    "roa_tarawiki", "rowiki", "ruewiki", "ruwiki", "rwwiki", "sahwiki", "satwiki",
    "sawiki", "scnwiki", "scowiki", "scwiki", "sdwiki", "sewiki", "sgwiki", "shiwiki",
    "shnwiki", "shwiki", "simplewiki", "siwiki", "skrwiki", "skwiki", "slwiki", "smnwiki",
    "smwiki", "snwiki", "sowiki", "sqwiki", "srnwiki", "srwiki", "sswiki", "stqwiki",
    "stwiki", "suwiki", "svwiki", "swwiki", "szlwiki", "szywiki", "tawiki", "taywiki",
    "tcywiki", "tetwiki", "tewiki", "tgwiki", "thwiki", "tiwiki", "tkwiki", "tlwiki",
    "tlywiki", "tnwiki", "towiki", "tpiwiki", "trvwiki", "trwiki", "tswiki", "ttwiki",
    "tumwiki", "twwiki", "tyvwiki", "tywiki", "udmwiki", "ugwiki", "ukwiki", "urwiki",
    "uzwiki", "vecwiki", "vepwiki", "vewiki", "viwiki", "vlswiki", "vowiki", "warwiki",
    "wawiki", "wowiki", "wuuwiki", "xalwiki", "xhwiki", "xmfwiki", "yiwiki", "yowiki",
    "zawiki", "zeawiki", "zghwiki", "zh_classicalwiki", "zh_min_nanwiki", "zh_yuewiki",
    "zhwiki", "zuwiki"], "wikidata_properties": ["P31"], "directory": "/tmp/research/mwaddlink"}'''
max_attempts: 1
name: Airflow SparkSkeinSubmitHook skein launcher mwaddlink__generate_wdproperties__20240502
node_label: ''
queue: production
services: {}
tags: []
user: ''
