acls:
  enable: false
  modify_groups: []
  modify_users: []
  ui_users: []
  view_groups: []
  view_users: []
file_systems: []
master:
  env:
    SPARK_CONF_DIR: /etc/spark3/conf
    SPARK_HOME: /usr/lib/spark3
  files:
    airflow.keytab:
      size: 0
      source: file:///pytest/path/to/airflow.keytab
      timestamp: 0
      type: FILE
      visibility: APPLICATION
  log_level: INFO
  resources:
    fpgas: 0
    gpus: 0
    memory: 2048
    vcores: 1
  script: spark3-submit --driver-cores 1 --conf spark.executorEnv.SPARK_HOME=/usr/lib/spark3
    --conf spark.executorEnv.SPARK_CONF_DIR=/etc/spark3/conf --master yarn --conf
    spark.dynamicAllocation.maxExecutors=1 --conf spark.hadoop.mapreduce.fileoutputcommitter.algorithm.version=2
    --conf spark.yarn.appMasterEnv.SPARK_CONF_DIR=/etc/spark3/conf --conf spark.yarn.appMasterEnv.SPARK_HOME=/usr/lib/spark3
    --executor-cores 4 --executor-memory 4G --driver-memory 2G --keytab airflow.keytab
    --principal airflow --name refine_webrequest_frontend_hourly_upload__extract_data_loss_errors__20241126
    --class org.apache.spark.sql.hive.thriftserver.WMFSparkSQLCLIDriver --queue production
    --deploy-mode client hdfs:///wmf/cache/artifacts/airflow/analytics/wmf-sparksqlclidriver-1.0.0.jar
    -f hdfs://analytics-hadoop/wmf/refinery/current/hql/webrequest/extract_data_loss.hql
    -d webrequest_source=upload -d year=2024 -d month=11 -d day=26 -d hour=1 -d source_table=wmf_staging.webrequest_frontend_sequence_stats_hourly
    -d target=hdfs://analytics-hadoop/wmf/data/raw/webrequest_frontend_data_loss/upload/2024/11/26/1/ERROR
    -d incomplete_data_threshold=2.0 -d data_loss_threshold=2.0
max_attempts: 1
name: Airflow SparkSkeinSubmitHook skein launcher refine_webrequest_frontend_hourly_upload__extract_data_loss_errors__20241126
node_label: ''
queue: production
services: {}
tags: []
user: ''
