acls:
  enable: false
  modify_groups: []
  modify_users: []
  ui_users: []
  view_groups: []
  view_users: []
file_systems: []
master:
  env:
    SPARK_CONF_DIR: /etc/spark3/conf
    SPARK_HOME: /usr/lib/spark3
  files:
    airflow.keytab:
      size: 0
      source: file:///pytest/path/to/airflow.keytab
      timestamp: 0
      type: FILE
      visibility: APPLICATION
  log_level: INFO
  resources:
    fpgas: 0
    gpus: 0
    memory: 4096
    vcores: 2
  script: spark3-submit --driver-cores 2 --conf spark.executorEnv.SPARK_HOME=/usr/lib/spark3
    --conf spark.executorEnv.SPARK_CONF_DIR=/etc/spark3/conf --master yarn --conf
    spark.hadoop.mapred.output.compress=false --conf spark.hadoop.mapreduce.fileoutputcommitter.algorithm.version=2
    --conf spark.yarn.appMasterEnv.SPARK_CONF_DIR=/etc/spark3/conf --conf spark.yarn.appMasterEnv.SPARK_HOME=/usr/lib/spark3
    --executor-cores 2 --executor-memory 4G --driver-memory 4G --keytab airflow.keytab
    --principal airflow --name querypage_most_linked_templates_monthly__compute_frwiki__20240101
    --class org.apache.spark.sql.hive.thriftserver.WMFSparkSQLCLIDriver --queue production
    --deploy-mode client hdfs:///wmf/cache/artifacts/airflow/analytics/wmf-sparksqlclidriver-1.0.0.jar
    -f hdfs://analytics-hadoop/wmf/refinery/current/hql/querypage/MostTranscludedPages.hql
    -d wiki=frwiki -d source_table_templatelinks=wmf_raw.mediawiki_templatelinks -d
    source_table_linktarget=wmf_raw.mediawiki_private_linktarget -d destination_directory=hdfs://analytics-hadoop//tmp/platform_eng/querypage/MostTranscludedPages//frwiki/
    -d year=2023 -d month=12
max_attempts: 1
name: Airflow SparkSkeinSubmitHook skein launcher querypage_most_linked_templates_monthly__compute_frwiki__20240101
node_label: ''
queue: production
services: {}
tags: []
user: ''
