acls:
  enable: false
  modify_groups: []
  modify_users: []
  ui_users: []
  view_groups: []
  view_users: []
file_systems: []
master:
  env:
    SPARK_CONF_DIR: /etc/spark3/conf
    SPARK_HOME: /usr/lib/spark3
  files:
    airflow.keytab:
      size: 0
      source: file:///pytest/path/to/airflow.keytab
      timestamp: 0
      type: FILE
      visibility: APPLICATION
  log_level: INFO
  resources:
    fpgas: 0
    gpus: 0
    memory: 4096
    vcores: 2
  script: spark3-submit --driver-cores 2 --conf spark.executorEnv.SPARK_HOME=/usr/lib/spark3
    --conf spark.executorEnv.SPARK_CONF_DIR=/etc/spark3/conf --master yarn --conf
    spark.dynamicAllocation.maxExecutors=16 --conf spark.yarn.executor.memoryOverhead=2048
    --conf spark.hadoop.mapreduce.fileoutputcommitter.algorithm.version=2 --conf spark.yarn.appMasterEnv.SPARK_CONF_DIR=/etc/spark3/conf
    --conf spark.yarn.appMasterEnv.SPARK_HOME=/usr/lib/spark3 --executor-cores 4 --executor-memory
    8G --driver-memory 4G --keytab airflow.keytab --principal airflow --name wikipedia_preview_stats_daily__compute_wikipedia_preview_stats__20230530
    --class org.apache.spark.sql.hive.thriftserver.WMFSparkSQLCLIDriver --queue production
    --deploy-mode client hdfs:///wmf/cache/artifacts/airflow/analytics_product/wmf-sparksqlclidriver-1.0.0.jar
    -f https://gitlab.wikimedia.org/repos/product-analytics/data-pipelines/-/raw/4c3e9fd235ad44b50839c2d8781f896cd73c4d0b/wikipedia_preview/generate_wikipedia_preview_stats_daily.hql
    -d source_table=wmf.webrequest -d destination_table=wmf_product.wikipedia_preview_stats
    -d year=2023 -d month=5 -d day=29
max_attempts: 1
name: Airflow SparkSkeinSubmitHook skein launcher wikipedia_preview_stats_daily__compute_wikipedia_preview_stats__20230530
node_label: ''
queue: production
services: {}
tags: []
user: ''
