acls:
  enable: false
  modify_groups: []
  modify_users: []
  ui_users: []
  view_groups: []
  view_users: []
file_systems: []
master:
  env:
    SPARK_CONF_DIR: /etc/spark3/conf
    SPARK_HOME: /usr/lib/spark3
  files:
    airflow.keytab:
      size: 0
      source: file:///pytest/path/to/airflow.keytab
      timestamp: 0
      type: FILE
      visibility: APPLICATION
  log_level: INFO
  resources:
    fpgas: 0
    gpus: 0
    memory: 4096
    vcores: 2
  script: spark3-submit --driver-cores 2 --conf spark.executorEnv.SPARK_HOME=/usr/lib/spark3
    --conf spark.executorEnv.SPARK_CONF_DIR=/etc/spark3/conf --master yarn --conf
    spark.datahub.emitter=kafka --conf spark.extraListeners=datahub.spark.DatahubSparkListener
    --conf spark.datahub.kafka.bootstrap=test.kafka.jumbo:9092 --conf spark.datahub.kafka.schema_registry_url=https://test.schema.registry:30443/schema-registry/api/
    --conf spark.datahub.flow_name=airflow_webrequest_actor_metrics_rollup_hourly__compute_webrequest_actor_metrics_rollup
    --conf spark.dynamicAllocation.maxExecutors=128 --conf spark.executor.memoryOverhead=4096
    --conf spark.hadoop.mapreduce.fileoutputcommitter.algorithm.version=2 --conf spark.yarn.appMasterEnv.SPARK_CONF_DIR=/etc/spark3/conf
    --conf spark.yarn.appMasterEnv.SPARK_HOME=/usr/lib/spark3 --jars hdfs:///wmf/cache/artifacts/airflow/analytics/acryl-spark-lineage-0.2.16.jar
    --executor-cores 2 --executor-memory 8G --driver-memory 4G --keytab airflow.keytab
    --principal airflow --name webrequest_actor_metrics_rollup_hourly__compute_webrequest_actor_metrics_rollup__20230102
    --class org.apache.spark.sql.hive.thriftserver.WMFSparkSQLCLIDriver --queue production
    --deploy-mode client hdfs:///wmf/cache/artifacts/airflow/analytics/wmf-sparksqlclidriver-1.0.0.jar
    -f hdfs://analytics-hadoop/wmf/refinery/current/hql/webrequest/actor/compute_webrequest_actor_metrics_rollup_hourly.hql
    -d source_table=wmf.webrequest_actor_metrics_hourly -d destination_table=wmf.webrequest_actor_metrics_rollup_hourly
    -d version=0.2 -d coalesce_partitions=32 -d interval_end_year=2023 -d interval_end_month=1
    -d interval_end_day=2 -d interval_end_hour=1 -d interval_start_year=2023 -d interval_start_month=1
    -d interval_start_day=1 -d interval_start_hour=2
max_attempts: 1
name: Airflow SparkSkeinSubmitHook skein launcher webrequest_actor_metrics_rollup_hourly__compute_webrequest_actor_metrics_rollup__20230102
node_label: ''
queue: production
services: {}
tags: []
user: ''
