<?xml version="1.0" encoding="UTF-8" standalone="no"?>
<!-- Created with Inkscape (http://www.inkscape.org/) -->
<svg xmlns:dc="http://purl.org/dc/elements/1.1/" xmlns:cc="http://creativecommons.org/ns#" xmlns:rdf="http://www.w3.org/1999/02/22-rdf-syntax-ns#" xmlns:svg="http://www.w3.org/2000/svg" xmlns="http://www.w3.org/2000/svg" xmlns:sodipodi="http://sodipodi.sourceforge.net/DTD/sodipodi-0.dtd" xmlns:inkscape="http://www.inkscape.org/namespaces/inkscape" version="1.0" width="2in" height="2in" id="svg2848" sodipodi:version="0.32" inkscape:version="0.91 r13725" sodipodi:docname="toolforge-rgb-anvil-round.svg">
  <metadata id="metadata1970">
    <rdf:RDF>
      <cc:Work rdf:about="">
        <dc:format>image/svg+xml</dc:format>
        <dc:type rdf:resource="http://purl.org/dc/dcmitype/StillImage"/>
        <dc:title/>
      </cc:Work>
    </rdf:RDF>
  </metadata>
  <sodipodi:namedview inkscape:window-height="827" inkscape:window-width="1398" inkscape:pageshadow="2" inkscape:pageopacity="0.0" guidetolerance="10.0" gridtolerance="10.0" objecttolerance="10.0" borderopacity="1.0" bordercolor="#666666" pagecolor="#ffffff" id="base" height="900px" width="900px" inkscape:zoom="0.69657287" inkscape:cx="90" inkscape:cy="89.724998" inkscape:window-x="179" inkscape:window-y="0" inkscape:current-layer="svg2848" showgrid="false" showborder="false" inkscape:window-maximized="0" inkscape:document-units="in" units="in" fit-margin-top="0" fit-margin-left="0" fit-margin-right="0" fit-margin-bottom="0"/>
  <defs id="defs2850"/>
  <g id="g7705" transform="matrix(0.2,0,0,0.2,0,0.275)">
    <path inkscape:connector-curvature="0" id="path4265" d="m 292.0799,402.23438 0,27.62584 -111.66533,0 c 0,0 -3.18611,47.70008 28.71175,70.2917 35.00262,24.80023 82.95358,35.15124 82.95358,35.15124 l 0,17.58107 62.45132,0 c 4.06747,3.16615 7.13449,7.8749 7.13449,14.95312 0,12.43537 -10.67793,17.14689 -18.77556,18.93847 l -50.82115,0 0,65.2856 354.09724,0 0,-65.2856 -59.0198,0 c 0,0 -7.9811,-66.53553 59.00896,-104.19413 27.59904,-15.52507 76.56829,-22.59801 76.56829,-22.59801 l 0,-30.12346 -76.55745,0 0,-27.62584 -354.08634,0 z" style="display:inline;opacity:1;fill:#339966;fill-opacity:1;fill-rule:nonzero;stroke:none;stroke-width:1;stroke-linecap:round;stroke-linejoin:round;stroke-miterlimit:4;stroke-dasharray:none;stroke-opacity:1"/>
    <path inkscape:connector-curvature="0" id="path4257" d="m 459.36608,247.29511 -86.47195,13.84547 8.58963,63.37438 23.17357,60.93108 86.48279,-13.83463 -3.88761,-44.91374 167.93775,-20.55651 -14.75769,-54.58927 -163.1054,36.20462 -17.96109,-40.4614 z" style="display:inline;opacity:1;fill:#006699;fill-opacity:1;fill-rule:nonzero;stroke:none;stroke-width:1;stroke-linecap:round;stroke-linejoin:round;stroke-miterlimit:4;stroke-dasharray:none;stroke-opacity:1"/>
    <path inkscape:connector-curvature="0" d="m 233.39669,245.66622 -17.03814,9.83844 2.3782,2.39988 a 300.98671,301.70678 0 0 1 0.0978,-0.1301 l 25.62772,24.59607 24.25947,0 -27.99502,-36.70413 -7.32997,0 z m 91.30424,10.52259 -55.97925,1.95464 38.56109,53.85086 -16.16935,0.97732 68.413,70.48713 21.14292,0 -39.18007,-59.96454 16.9404,0.3803 -33.72874,-67.68549 z m -75.88414,41.12381 -34.82555,0.96648 120.65677,82.23685 -85.83122,-83.20333 z m 1.23791,62.89657 -12.59666,23.24957 61.11562,0 -48.51896,-23.24957 z" style="display:inline;opacity:1;fill:#990000;fill-opacity:1;fill-rule:nonzero;stroke:none;stroke-width:1;stroke-linecap:round;stroke-linejoin:round;stroke-miterlimit:4;stroke-dasharray:none;stroke-opacity:1" id="path4255"/>
    <path d="M 450,0 C 296.44174,0 160.77984,77.047236 79.5625,194.5625 l 87,50.25 C 230.1847,157.10508 333.43928,100 450,100 c 116.56072,0 219.8153,57.10508 283.4375,144.8125 l 87,-50.25 C 739.22016,77.047236 603.55826,0 450,0 Z" style="opacity:1;fill:#990000;fill-opacity:1;stroke:none;stroke-width:10;stroke-linecap:round;stroke-linejoin:round;stroke-miterlimit:4;stroke-dasharray:none;stroke-opacity:1" id="path4005" inkscape:connector-curvature="0"/>
    <path d="M 32.1875,282.75 C 11.448392,334.46664 0,390.90008 0,450 0,681.50364 175.0975,872.35712 400,897.25 l 0,-100.875 C 230.47074,772.0781 100,626.21538 100,450 c 0,-40.89156 7.03061,-80.13628 19.9375,-116.625 l -87.75,-50.625 z" style="opacity:1;fill:#006699;fill-opacity:1;stroke:none;stroke-width:10;stroke-linecap:round;stroke-linejoin:round;stroke-miterlimit:4;stroke-dasharray:none;stroke-opacity:1" id="path4003" inkscape:connector-curvature="0"/>
    <path d="m 867.8125,282.75 -87.75,50.625 C 792.9694,369.86372 800,409.10844 800,450 800,626.21536 669.52928,772.0781 500,796.375 l 0,100.875 C 724.90248,872.35712 899.99998,681.50364 900,450 900,390.90008 888.5516,334.46664 867.8125,282.75 Z" style="opacity:1;fill:#006699;fill-opacity:1;stroke:none;stroke-width:10;stroke-linecap:round;stroke-linejoin:round;stroke-miterlimit:4;stroke-dasharray:none;stroke-opacity:1" id="path3918" inkscape:connector-curvature="0"/>
  </g>
</svg>