{
	"Z1K1": "Z2",
	"Z2K1": {
		"Z1K1": "Z6",
		"Z6K1": "Z204"
	},
	"Z2K2": {
		"Z1K1": "Z14",
		"Z14K1": "Z104",
		"Z14K4": {
			"Z1K1": "Z6",
			"Z6K1": "Z204"
		}
	},
	"Z2K3": {
		"Z1K1": "Z12",
		"Z12K1": [
			"Z11",
			{
				"Z1K1": "Z11",
				"Z11K1": "Z1002",
				"Z11K2": "Validate type built-in"
			}
		]
	}
}
