{
	"Z1K1": "Z2",
	"Z2K1": {
		"Z1K1": "Z6",
		"Z6K1": "Z8442"
	},
	"Z2K2": {
		"Z1K1": "Z20",
		"Z20K1": "Z844",
		"Z20K2": {
			"Z1K1": "Z7",
			"Z7K1": "Z844",
			"Z844K1": {
				"Z1K1": "Z40",
				"Z40K1": "Z42"
			},
			"Z844K2": {
				"Z1K1": "Z40",
				"Z40K1": "Z41"
			}
		},
		"Z20K3": {
			"Z1K1": "Z7",
			"Z7K1": "Z844",
			"Z844K2": {
				"Z1K1": "Z40",
				"Z40K1": "Z42"
			}
		}
	},
	"Z2K3": {
		"Z1K1": "Z12",
		"Z12K1": [
			"Z11",
			{
				"Z1K1": "Z11",
				"Z11K1": "Z1002",
				"Z11K2": "Test case for Boolean equality False True"
			}
		]
	}
}
